{"text_format":"1","workbook":"xlsx","n_sheets":10,"sheets":["Series Winners","Series Table","Llanbedr 2 Bleanafon","Longtown Loop","Cwmdu","Middletown Show","Guto Nyth Bran","Brecon Beacons","Fan Fawr","WFRA Membership March 2017"],"not_rendered":{"charts":0,"images":1,"macros":1,"external_links":2,"defined_names":59,"comments":0,"pivot_tables":0},"unopened":[],"bounds":{"document_bytes":16777216,"sheet_cells":100000,"rows_first":2000,"rows_last":500,"rows_between":2000,"halvings":0,"cell_chars":16384,"cell_head_chars":4096},"cells_cut":0,"cells_raw":0,"read":"whole","date_system":"1900"}

{"sheet":"Series Winners","index":0,"n_rows":22,"n_cols":11,"rows_kept":22,"cut":false,"hidden":false,"merged":[]}
[]
[]
[]
[null,"Name","Club","Point","Races completed",null,null,"Name","Club","Point","Races completed"]
[null,"M",null,null,null,null,null,"F"]
[1,null,null,null,null,null,1]
[2,null,null,null,null,null,2]
[]
[null,"MO40",null,null,null,null,null,"FO40"]
[1,null,null,null,null,null,1]
[2,null,null,null,null,null,2]
[3]
[]
[null,"M050",null,null,null,null,null,"FO50"]
[1,null,null,null,null,null,1]
[2,null,null,null,null,null,2]
[]
[null,"MO60"]
[1]
[]
[null,"MO70"]
[1]

{"sheet":"Series Table","index":1,"n_rows":258,"n_cols":24,"rows_kept":258,"cut":false,"hidden":false,"merged":[[0,18,0,19],[0,16,0,17],[0,6,0,7],[0,8,0,9],[0,10,0,11],[0,12,0,13],[0,14,0,15]]}
[null,"2018 WFRA",null,null,null,null,"Llanbedr 2 Bleanafon",null,"Longtown Loop",null,"Cwmdu",null,"Middletown Show",null,"Guto Nyth Bran",null,"Brecon Beacons",null,"Fan Fawr"]
["Pos","Name","Club","Gender","Cat.","Total","Time","Score","Time","Score","Time","Score","Time","Score","Time","Score","Time","Score","Time","Score","Competed","Ave (Best of 4)",null,"WFRA membership as of March 2018"]
[{"$f":"ROW(A1)","v":1},"Matt O'Keefe",{"$f":"IFERROR(VLOOKUP(B3,INDIRECT(\"'\"&$I$1&\"'!\"&\"$C$2:$H$200\"),2,FALSE),\"\")","v":"MDC"},{"$f":"IFERROR(VLOOKUP(B3,INDIRECT(\"'\"&$I$1&\"'!\"&\"$C$2:$H$200\"),3,FALSE),\"\")","v":"M"},{"$f":"IFERROR(VLOOKUP(B3,INDIRECT(\"'\"&$I$1&\"'!\"&\"$C$2:$H$200\"),4,FALSE),\"\")","v":"SM"},{"$f":"SUM(LARGE((H3,J3,L3,N3,P3,R3),{1,2,3,4}))","v":357.40339779503353},{"$f":"IFERROR(VLOOKUP(B3,INDIRECT(\"'\"&$G$1&\"'!\"&\"$C$2:$H$200\"),5,FALSE),\"\")","v":"02:27:24"},{"$f":"IFERROR(VLOOKUP(B3,INDIRECT(\"'\"&$G$1&\"'!\"&\"$C$2:$H$200\"),6,FALSE),0)","v":124.68833026772941},{"$f":"IFERROR(VLOOKUP(B3,INDIRECT(\"'\"&$I$1&\"'!\"&\"$C$2:$G$200\"),5,FALSE),\"\")","v":3.0201388888888889},{"$f":"IFERROR(VLOOKUP(B3,INDIRECT(\"'\"&$I$1&\"'!\"&\"$C$2:$H$200\"),6,FALSE),0)","v":122.38086739246832},{"$f":"IFERROR(VLOOKUP(B3,INDIRECT(\"'\"&$K$1&\"'!\"&\"$C$2:$H$200\"),5,FALSE),\"\")","v":"01:33:06"},{"$f":"IFERROR(VLOOKUP(B3,INDIRECT(\"'\"&$K$1&\"'!\"&\"$C$2:$H$200\"),6,FALSE),0)","v":110.3342001348358},{"$f":"IFERROR(VLOOKUP(B3,INDIRECT(\"'\"&$M$1&\"'!\"&\"$C$2:$h$200\"),5,FALSE),\"\")","v":""},{"$f":"IFERROR(VLOOKUP(B3,INDIRECT(\"'\"&$M$1&\"'!\"&\"$C$2:$h$200\"),6,FALSE),0)","v":0},{"$f":"IFERROR(VLOOKUP(B3,INDIRECT(\"'\"&$O$1&\"'!\"&\"$C$2:$h$200\"),5,FALSE),\"\")","v":""},{"$f":"IFERROR(VLOOKUP(B3,INDIRECT(\"'\"&$O$1&\"'!\"&\"$C$2:$h$200\"),6,FALSE),0)","v":0},{"$f":"IFERROR(VLOOKUP(B3,INDIRECT(\"'\"&$Q$1&\"'!\"&\"$C$2:$h$200\"),5,FALSE),\"\")","v":""},{"$f":"IFERROR(VLOOKUP(B3,INDIRECT(\"'\"&$Q$1&\"'!\"&\"$C$2:$h$200\"),6,FALSE),0)","v":0},{"$f":"IFERROR(VLOOKUP(D3,INDIRECT(\"'\"&$Q$1&\"'!\"&\"$C$2:$h$200\"),5,FALSE),\"\")","v":""},{"$f":"IFERROR(VLOOKUP(D3,INDIRECT(\"'\"&$S$1&\"'!\"&\"$C$2:$h$200\"),6,FALSE),0)","v":0},{"$f":"7-COUNTIF(G3:T3,\"\")","v":3},{"$f":"F3/IF(U3>4,4,U3)","v":119.13446593167784}]
[{"$f":"ROW(A2)","v":2},"Dan Sandford",{"$f":"IFERROR(VLOOKUP(B4,INDIRECT(\"'\"&$I$1&\"'!\"&\"$C$2:$H$200\"),2,FALSE),\"\")","v":"FODAC"},{"$f":"IFERROR(VLOOKUP(B4,INDIRECT(\"'\"&$I$1&\"'!\"&\"$C$2:$H$200\"),3,FALSE),\"\")","v":"M"},{"$f":"IFERROR(VLOOKUP(B4,INDIRECT(\"'\"&$I$1&\"'!\"&\"$C$2:$H$200\"),4,FALSE),\"\")","v":"MV40"},{"$f":"SUM(LARGE((H4,J4,L4,N4,P4,R4),{1,2,3,4}))","v":352.21785631615694},"02:31:11",122.75529668233531,3.1854166666666668,118.13314295912902,"01:32:04",111.32941667469262,"",0,"",0,"",0,"",0,3,117.40595210538565]
[3,"Helen Brown",{"$f":"IFERROR(VLOOKUP(B5,INDIRECT(\"'\"&$K$1&\"'!\"&\"$C$2:$H$200\"),2,FALSE),\"\")","v":"Mynydd Du"},{"$f":"IFERROR(VLOOKUP(B5,INDIRECT(\"'\"&$K$1&\"'!\"&\"$C$2:$H$200\"),3,FALSE),\"\")","v":"F"},{"$f":"IFERROR(VLOOKUP(B5,INDIRECT(\"'\"&$K$1&\"'!\"&\"$C$2:$H$200\"),4,FALSE),\"\")","v":"F40"},{"$f":"SUM(LARGE((H5,J5,L5,N5,P5,R5),{1,2,3,4}))","v":339.23768255215384},"02:41:09",117.66298794195791,3.4486111111111111,111.36890951276102,"01:33:14",110.2057850974349,"",0,"",0,"",0,"",0,3,113.07922751738461]
[4,"John Aggleton",{"$f":"IFERROR(VLOOKUP(B6,INDIRECT(\"'\"&$I$1&\"'!\"&\"$C$2:$H$200\"),2,FALSE),\"\")","v":"MDC"},{"$f":"IFERROR(VLOOKUP(B6,INDIRECT(\"'\"&$I$1&\"'!\"&\"$C$2:$H$200\"),3,FALSE),\"\")","v":"M"},{"$f":"IFERROR(VLOOKUP(B6,INDIRECT(\"'\"&$I$1&\"'!\"&\"$C$2:$H$200\"),4,FALSE),\"\")","v":"MV60"},{"$f":"SUM(LARGE((H6,J6,L6,N6,P6,R6),{1,2,3,4}))","v":331.96614664739946},"02:49:48",113.24340895156344,3.4527777777777775,111.26182402284491,"01:36:05",107.46091367299111,"",0,"",0,"",0,"",0,3,110.65538221579982]
[5,"Paul Tucker","Mynydd Du","M","MV50",{"$f":"SUM(LARGE((H7,J7,L7,N7,P7,R7),{1,2,3,4}))","v":315.33969293792336},"03:08:20",103.77409905306901,3.6444444444444444,106.33589148670355,"01:38:24",105.22970239815082,"",0,"",0,"",0,"",0,3,105.11323097930779]
[6,"Rhian Probert","Mynydd Du","F","FV40",{"$f":"SUM(LARGE((H8,J8,L8,N8,P8,R8),{1,2,3,4}))","v":315.20009279017114},"02:58:49",108.63648749914843,3.6979166666666665,104.96162769944672,"01:42:10",101.60197759157596,"",0,"",0,"",0,"",0,3,105.06669759672371]
[7,"Debbie Stenner","Forest of Dean AC","F","FV40",{"$f":"SUM(LARGE((H9,J9,L9,N9,P9,R9),{1,2,3,4}))","v":300.20200929246784},"03:14:15",100.75107296137338,3.692361111111111,105.10440835266822,"01:49:42",94.346527978426266,"",0,"",0,"",0,"",0,3,100.06733643082261]
[8,"gareth welch",0,"M","MV40",{"$f":"SUM(LARGE((H10,J10,L10,N10,P10,R10),{1,2,3,4}))","v":270.84201025169074},"03:45:29",84.792901423802689,4.0145833333333334,96.823130465821876,"01:55:01",89.225978362066186,"",0,"",0,"",0,"",0,3,90.280670083896908]
[9,"John Jaspers",0,"M","MV40",{"$f":"SUM(LARGE((H11,J11,L11,N11,P11,R11),{1,2,3,4}))","v":266.03409564839285},"03:44:27",85.320866544042502,4.1909722222222223,92.289844726039604,"01:55:51",88.423384378310715,"",0,"",0,"",0,"",0,3,88.678031882797612]
[10,"Peter Ryder","Aberdare Valley","M","SM",{"$f":"SUM(LARGE((H12,J12,L12,N12,P12,R12),{1,2,3,4}))","v":257.72925792517913},"02:15:35",130.72586688466515,2.8402777777777781,127.00339104051399,"",0,"",0,"",0,"",0,"",0,2,128.86462896258956]
[11,"Caroline Dallimore",{"$f":"IFERROR(VLOOKUP(B13,INDIRECT(\"'\"&$K$1&\"'!\"&\"$C$2:$H$200\"),2,FALSE),\"\")","v":"MDC"},{"$f":"IFERROR(VLOOKUP(B13,INDIRECT(\"'\"&$K$1&\"'!\"&\"$C$2:$H$200\"),3,FALSE),\"\")","v":"F"},{"$f":"IFERROR(VLOOKUP(B13,INDIRECT(\"'\"&$K$1&\"'!\"&\"$C$2:$H$200\"),4,FALSE),\"\")","v":"F60"},{"$f":"SUM(LARGE((H13,J13,L13,N13,P13,R13),{1,2,3,4}))","v":243.05746420266561},"03:46:27",84.298998569384807,4.5618055555555559,82.759236123505246,"02:08:45",75.999229509775574,"",0,"",0,"",0,"",0,3,81.019154734221871]
[12,"Paul Jeggo",{"$f":"IFERROR(VLOOKUP(B14,INDIRECT(\"'\"&$I$1&\"'!\"&\"$C$2:$H$200\"),2,FALSE),\"\")","v":"Springfield"},{"$f":"IFERROR(VLOOKUP(B14,INDIRECT(\"'\"&$I$1&\"'!\"&\"$C$2:$H$200\"),3,FALSE),\"\")","v":"M"},{"$f":"IFERROR(VLOOKUP(B14,INDIRECT(\"'\"&$I$1&\"'!\"&\"$C$2:$H$200\"),4,FALSE),\"\")","v":"MV50"},{"$f":"SUM(LARGE((H14,J14,L14,N14,P14,R14),{1,2,3,4}))","v":230.14777132534019},"02:43:43",116.35159070781387,3.3541666666666665,113.79618061752632,"",0,"",0,"",0,"",0,"",0,2,115.07388566267009]
[13,"Tom Turner",{"$f":"IFERROR(VLOOKUP(B15,INDIRECT(\"'\"&$K$1&\"'!\"&\"$C$2:$H$200\"),2,FALSE),\"\")","v":"Mynydd Du"},{"$f":"IFERROR(VLOOKUP(B15,INDIRECT(\"'\"&$K$1&\"'!\"&\"$C$2:$H$200\"),3,FALSE),\"\")","v":"M"},{"$f":"IFERROR(VLOOKUP(B15,INDIRECT(\"'\"&$K$1&\"'!\"&\"$C$2:$H$200\"),4,FALSE),\"\")","v":"M"},{"$f":"SUM(LARGE((H15,J15,L15,N15,P15,R15),{1,2,3,4}))","v":227.95666241158634},"",0,3.3208333333333333,114.65286453685523,"01:30:01",113.3037978747311,"",0,"",0,"",0,"",0,2,113.97833120579317]
[14,"Dave Powell",{"$f":"IFERROR(VLOOKUP(B16,INDIRECT(\"'\"&$I$1&\"'!\"&\"$C$2:$H$200\"),2,FALSE),\"\")","v":"Aberystwyth AC"},{"$f":"IFERROR(VLOOKUP(B16,INDIRECT(\"'\"&$I$1&\"'!\"&\"$C$2:$H$200\"),3,FALSE),\"\")","v":"M"},{"$f":"IFERROR(VLOOKUP(B16,INDIRECT(\"'\"&$I$1&\"'!\"&\"$C$2:$H$200\"),4,FALSE),\"\")","v":"MV50"},{"$f":"SUM(LARGE((H16,J16,L16,N16,P16,R16),{1,2,3,4}))","v":224.10478918375514},"02:44:01",116.19831051161522,3.5833333333333335,107.90647867213991,"",0,"",0,"",0,"",0,"",0,2,112.05239459187757]
[15,"Hayley Evans",{"$f":"IFERROR(VLOOKUP(B17,INDIRECT(\"'\"&$G$1&\"'!\"&\"$C$2:$H$200\"),2,FALSE),\"\")","v":"Buckley Runners"},{"$f":"IFERROR(VLOOKUP(B17,INDIRECT(\"'\"&$G$1&\"'!\"&\"$C$2:$H$200\"),3,FALSE),\"\")","v":"F"},{"$f":"IFERROR(VLOOKUP(B17,INDIRECT(\"'\"&$G$1&\"'!\"&\"$C$2:$H$200\"),4,FALSE),\"\")","v":"Open"},{"$f":"SUM(LARGE((H17,J17,L17,N17,P17,R17),{1,2,3,4}))","v":223.71213418035359},"02:46:34",114.89542884392669,3.5479166666666671,108.81670533642689,"",0,"",0,"",0,"",0,"",0,2,111.85606709017679]
[16,"Andy Pritchard",{"$f":"IFERROR(VLOOKUP(B18,INDIRECT(\"'\"&$I$1&\"'!\"&\"$C$2:$H$200\"),2,FALSE),\"\")","v":"Buckley Runners"},{"$f":"IFERROR(VLOOKUP(B18,INDIRECT(\"'\"&$I$1&\"'!\"&\"$C$2:$H$200\"),3,FALSE),\"\")","v":"M"},{"$f":"IFERROR(VLOOKUP(B18,INDIRECT(\"'\"&$I$1&\"'!\"&\"$C$2:$H$200\"),4,FALSE),\"\")","v":"MV40"},{"$f":"SUM(LARGE((H18,J18,L18,N18,P18,R18),{1,2,3,4}))","v":220.60698143069712},"02:53:52",111.16561073642619,3.5236111111111108,109.44137069427093,"",0,"",0,"",0,"",0,"",0,2,110.30349071534856]
[17,"Steve 'Amazing' Hepton…",{"$f":"IFERROR(VLOOKUP(B19,INDIRECT(\"'\"&$G$1&\"'!\"&\"$C$2:$H$200\"),2,FALSE),\"\")","v":"Mynydd Du"},{"$f":"IFERROR(VLOOKUP(B19,INDIRECT(\"'\"&$G$1&\"'!\"&\"$C$2:$H$200\"),3,FALSE),\"\")","v":"M"},{"$f":"IFERROR(VLOOKUP(B19,INDIRECT(\"'\"&$G$1&\"'!\"&\"$C$2:$H$200\"),4,FALSE),\"\")","v":"V40"},{"$f":"SUM(LARGE((H19,J19,L19,N19,P19,R19),{1,2,3,4}))","v":217.22332833550038},"02:55:44",110.21186729341235,"",0,"01:36:33",107.01146104208803,"",0,"",0,"",0,"",0,2,108.61166416775019]
[18,"Helen Marshall",{"$f":"IFERROR(VLOOKUP(B20,INDIRECT(\"'\"&$K$1&\"'!\"&\"$C$2:$H$200\"),2,FALSE),\"\")","v":"Aberystwyth"},{"$f":"IFERROR(VLOOKUP(B20,INDIRECT(\"'\"&$K$1&\"'!\"&\"$C$2:$H$200\"),3,FALSE),\"\")","v":"F"},{"$f":"IFERROR(VLOOKUP(B20,INDIRECT(\"'\"&$K$1&\"'!\"&\"$C$2:$H$200\"),4,FALSE),\"\")","v":"F"},{"$f":"SUM(LARGE((H20,J20,L20,N20,P20,R20),{1,2,3,4}))","v":215.32326586255317},"",0,3.556944444444444,108.584686774942,"01:36:50",106.73857908761117,"",0,"",0,"",0,"",0,2,107.66163293127659]
[19,"Gary Gunner",{"$f":"IFERROR(VLOOKUP(B21,INDIRECT(\"'\"&$K$1&\"'!\"&\"$C$2:$H$200\"),2,FALSE),\"\")","v":"Croft Ambrey"},{"$f":"IFERROR(VLOOKUP(B21,INDIRECT(\"'\"&$K$1&\"'!\"&\"$C$2:$H$200\"),3,FALSE),\"\")","v":"M"},{"$f":"IFERROR(VLOOKUP(B21,INDIRECT(\"'\"&$K$1&\"'!\"&\"$C$2:$H$200\"),4,FALSE),\"\")","v":"M70"},{"$f":"SUM(LARGE((H21,J21,L21,N21,P21,R21),{1,2,3,4}))","v":213.72174571169421},"04:18:58",67.685128414742152,4.552777777777778,82.991254684990182,"02:22:12",63.045362611961878,"",0,"",0,"",0,"",0,3,71.240581903898075]
[20,"Oliver Lamford",{"$f":"IFERROR(VLOOKUP(B22,INDIRECT(\"'\"&$I$1&\"'!\"&\"$C$2:$H$200\"),2,FALSE),\"\")","v":"MDC"},{"$f":"IFERROR(VLOOKUP(B22,INDIRECT(\"'\"&$I$1&\"'!\"&\"$C$2:$H$200\"),3,FALSE),\"\")","v":"M"},{"$f":"IFERROR(VLOOKUP(B22,INDIRECT(\"'\"&$I$1&\"'!\"&\"$C$2:$H$200\"),4,FALSE),\"\")","v":"SM"},{"$f":"SUM(LARGE((H22,J22,L22,N22,P22,R22),{1,2,3,4}))","v":212.97226589888629},"03:04:14",105.86892840111723,3.6145833333333335,107.10333749776906,"",0,"",0,"",0,"",0,"",0,2,106.48613294944315]
[21,"David Mullin",{"$f":"IFERROR(VLOOKUP(B23,INDIRECT(\"'\"&$K$1&\"'!\"&\"$C$2:$H$200\"),2,FALSE),\"\")","v":"Mercia"},{"$f":"IFERROR(VLOOKUP(B23,INDIRECT(\"'\"&$K$1&\"'!\"&\"$C$2:$H$200\"),3,FALSE),\"\")","v":"M"},{"$f":"IFERROR(VLOOKUP(B23,INDIRECT(\"'\"&$K$1&\"'!\"&\"$C$2:$H$200\"),4,FALSE),\"\")","v":"M40"},{"$f":"SUM(LARGE((H23,J23,L23,N23,P23,R23),{1,2,3,4}))","v":212.24049420606212},"",0,3.5013888888888887,110.01249330715687,"01:41:31",102.22800089890525,"",0,"",0,"",0,"",0,2,106.12024710303106]
[22,"Les Williams",{"$f":"IFERROR(VLOOKUP(B24,INDIRECT(\"'\"&$K$1&\"'!\"&\"$C$2:$H$200\"),2,FALSE),\"\")","v":"Eryri"},{"$f":"IFERROR(VLOOKUP(B24,INDIRECT(\"'\"&$K$1&\"'!\"&\"$C$2:$H$200\"),3,FALSE),\"\")","v":"M"},{"$f":"IFERROR(VLOOKUP(B24,INDIRECT(\"'\"&$K$1&\"'!\"&\"$C$2:$H$200\"),4,FALSE),\"\")","v":"M70"},{"$f":"SUM(LARGE((H24,J24,L24,N24,P24,R24),{1,2,3,4}))","v":211.34990401004802},"04:12:23",71.048777164656983,4.7347222222222225,78.315188291986431,"02:23:18",61.985938553404594,"",0,"",0,"",0,"",0,3,70.449968003349341]
[23,"Sam Weale",{"$f":"IFERROR(VLOOKUP(B25,INDIRECT(\"'\"&$K$1&\"'!\"&\"$C$2:$H$200\"),2,FALSE),\"\")","v":"Monross"},{"$f":"IFERROR(VLOOKUP(B25,INDIRECT(\"'\"&$K$1&\"'!\"&\"$C$2:$H$200\"),3,FALSE),\"\")","v":"M"},{"$f":"IFERROR(VLOOKUP(B25,INDIRECT(\"'\"&$K$1&\"'!\"&\"$C$2:$H$200\"),4,FALSE),\"\")","v":"M"},{"$f":"SUM(LARGE((H25,J25,L25,N25,P25,R25),{1,2,3,4}))","v":207.92516877454125},"03:03:15",106.37134682199058,"",0,"01:42:13",101.55382195255065,"",0,"",0,"",0,"",0,2,103.96258438727062]
[24,"Matthew Lawson",{"$f":"IFERROR(VLOOKUP(B26,INDIRECT(\"'\"&$K$1&\"'!\"&\"$C$2:$H$200\"),2,FALSE),\"\")","v":"Chepstw"},{"$f":"IFERROR(VLOOKUP(B26,INDIRECT(\"'\"&$K$1&\"'!\"&\"$C$2:$H$200\"),3,FALSE),\"\")","v":"M"},{"$f":"IFERROR(VLOOKUP(B26,INDIRECT(\"'\"&$K$1&\"'!\"&\"$C$2:$H$200\"),4,FALSE),\"\")","v":"M40"},{"$f":"SUM(LARGE((H26,J26,L26,N26,P26,R26),{1,2,3,4}))","v":206.26981991326312},"02:59:46",108.15110021118603,"",0,"01:45:47",98.118719702077101,"",0,"",0,"",0,"",0,2,103.13490995663156]
[25,"Louise Barker",{"$f":"IFERROR(VLOOKUP(B27,INDIRECT(\"'\"&$I$1&\"'!\"&\"$C$2:$H$200\"),2,FALSE),\"\")","v":"Aberystwyth AC"},{"$f":"IFERROR(VLOOKUP(B27,INDIRECT(\"'\"&$I$1&\"'!\"&\"$C$2:$H$200\"),3,FALSE),\"\")","v":"F"},{"$f":"IFERROR(VLOOKUP(B27,INDIRECT(\"'\"&$I$1&\"'!\"&\"$C$2:$H$200\"),4,FALSE),\"\")","v":"FV40"},{"$f":"SUM(LARGE((H27,J27,L27,N27,P27,R27),{1,2,3,4}))","v":205.29582181170957},"03:04:31",105.72416377137405,3.9076388888888887,99.571658040335535,"",0,"",0,"",0,"",0,"",0,2,102.64791090585479]
[26,"Richard Cronin",{"$f":"IFERROR(VLOOKUP(B28,INDIRECT(\"'\"&$K$1&\"'!\"&\"$C$2:$H$200\"),2,FALSE),\"\")","v":"MDC"},{"$f":"IFERROR(VLOOKUP(B28,INDIRECT(\"'\"&$K$1&\"'!\"&\"$C$2:$H$200\"),3,FALSE),\"\")","v":"M"},{"$f":"IFERROR(VLOOKUP(B28,INDIRECT(\"'\"&$K$1&\"'!\"&\"$C$2:$H$200\"),4,FALSE),\"\")","v":"M"},{"$f":"SUM(LARGE((H28,J28,L28,N28,P28,R28),{1,2,3,4}))","v":204.89068197537679},"03:03:00",106.49908031882281,"",0,"01:45:30",98.391601656553988,"",0,"",0,"",0,"",0,2,102.4453409876884]
[27,"Sammi Toop",{"$f":"IFERROR(VLOOKUP(B29,INDIRECT(\"'\"&$K$1&\"'!\"&\"$C$2:$H$200\"),2,FALSE),\"\")","v":"Mynydd Du"},{"$f":"IFERROR(VLOOKUP(B29,INDIRECT(\"'\"&$K$1&\"'!\"&\"$C$2:$H$200\"),3,FALSE),\"\")","v":"F"},{"$f":"IFERROR(VLOOKUP(B29,INDIRECT(\"'\"&$K$1&\"'!\"&\"$C$2:$H$200\"),4,FALSE),\"\")","v":"F"},{"$f":"SUM(LARGE((H29,J29,L29,N29,P29,R29),{1,2,3,4}))","v":204.44600012845439},"03:04:45",105.60494584099733,"",0,"01:45:02",98.841054287457069,"",0,"",0,"",0,"",0,2,102.22300006422719]
[28,"Luke Davies",{"$f":"IFERROR(VLOOKUP(B30,INDIRECT(\"'\"&$I$1&\"'!\"&\"$C$2:$H$200\"),2,FALSE),\"\")","v":"Swansea Harriers"},{"$f":"IFERROR(VLOOKUP(B30,INDIRECT(\"'\"&$I$1&\"'!\"&\"$C$2:$H$200\"),3,FALSE),\"\")","v":"M"},{"$f":"IFERROR(VLOOKUP(B30,INDIRECT(\"'\"&$I$1&\"'!\"&\"$C$2:$H$200\"),4,FALSE),\"\")","v":"SM"},{"$f":"SUM(LARGE((H30,J30,L30,N30,P30,R30),{1,2,3,4}))","v":203.47347417615185},"03:13:11",101.29606921452414,3.8062499999999999,102.1774049616277,"",0,"",0,"",0,"",0,"",0,2,101.73673708807593]
[29,"Matthew Haynes",{"$f":"IFERROR(VLOOKUP(B31,INDIRECT(\"'\"&$K$1&\"'!\"&\"$C$2:$H$200\"),2,FALSE),\"\")","v":"Hay Hotfooters"},{"$f":"IFERROR(VLOOKUP(B31,INDIRECT(\"'\"&$K$1&\"'!\"&\"$C$2:$H$200\"),3,FALSE),\"\")","v":"M"},{"$f":"IFERROR(VLOOKUP(B31,INDIRECT(\"'\"&$K$1&\"'!\"&\"$C$2:$H$200\"),4,FALSE),\"\")","v":"M40"},{"$f":"SUM(LARGE((H31,J31,L31,N31,P31,R31),{1,2,3,4}))","v":202.52696293216749},"",0,3.7256944444444446,104.24772443333927,"01:45:37",98.279238498828221,"",0,"",0,"",0,"",0,2,101.26348146608375]
[30,"Martin Simmons",{"$f":"IFERROR(VLOOKUP(B32,INDIRECT(\"'\"&$K$1&\"'!\"&\"$C$2:$H$200\"),2,FALSE),\"\")","v":0},{"$f":"IFERROR(VLOOKUP(B32,INDIRECT(\"'\"&$K$1&\"'!\"&\"$C$2:$H$200\"),3,FALSE),\"\")","v":"M"},{"$f":"IFERROR(VLOOKUP(B32,INDIRECT(\"'\"&$K$1&\"'!\"&\"$C$2:$H$200\"),4,FALSE),\"\")","v":"M50"},{"$f":"SUM(LARGE((H32,J32,L32,N32,P32,R32),{1,2,3,4}))","v":191.46849098528097},"",0,4.0604166666666668,95.645190076744598,"01:48:10",95.823300908536368,"",0,"",0,"",0,"",0,2,95.734245492640483]
[31,"Nick Dallimore",{"$f":"IFERROR(VLOOKUP(B33,INDIRECT(\"'\"&$I$1&\"'!\"&\"$C$2:$H$200\"),2,FALSE),\"\")","v":"MDC"},{"$f":"IFERROR(VLOOKUP(B33,INDIRECT(\"'\"&$I$1&\"'!\"&\"$C$2:$H$200\"),3,FALSE),\"\")","v":"M"},{"$f":"IFERROR(VLOOKUP(B33,INDIRECT(\"'\"&$I$1&\"'!\"&\"$C$2:$H$200\"),4,FALSE),\"\")","v":"MV60"},{"$f":"SUM(LARGE((H33,J33,L33,N33,P33,R33),{1,2,3,4}))","v":190.76308892262404},"03:46:35",84.230874037740961,3.6368055555555556,106.53221488488309,"",0,"",0,"",0,"",0,"",0,2,95.381544461312018]
[32,"Andrew Wood",{"$f":"IFERROR(VLOOKUP(B34,INDIRECT(\"'\"&$I$1&\"'!\"&\"$C$2:$H$200\"),2,FALSE),\"\")","v":0},{"$f":"IFERROR(VLOOKUP(B34,INDIRECT(\"'\"&$I$1&\"'!\"&\"$C$2:$H$200\"),3,FALSE),\"\")","v":"M"},{"$f":"IFERROR(VLOOKUP(B34,INDIRECT(\"'\"&$I$1&\"'!\"&\"$C$2:$H$200\"),4,FALSE),\"\")","v":"SM"},{"$f":"SUM(LARGE((H34,J34,L34,N34,P34,R34),{1,2,3,4}))","v":188.14583846349475},"03:32:38",91.358403160978256,4.0159722222222225,96.787435302516499,"",0,"",0,"",0,"",0,"",0,2,94.072919231747377]
[33,"Richard Simpson",{"$f":"IFERROR(VLOOKUP(B35,INDIRECT(\"'\"&$K$1&\"'!\"&\"$C$2:$H$200\"),2,FALSE),\"\")","v":0},{"$f":"IFERROR(VLOOKUP(B35,INDIRECT(\"'\"&$K$1&\"'!\"&\"$C$2:$H$200\"),3,FALSE),\"\")","v":"M"},{"$f":"IFERROR(VLOOKUP(B35,INDIRECT(\"'\"&$K$1&\"'!\"&\"$C$2:$H$200\"),4,FALSE),\"\")","v":"M40"},{"$f":"SUM(LARGE((H35,J35,L35,N35,P35,R35),{1,2,3,4}))","v":184.87672972898127},"",0,3.9465277777777779,98.572193467785112,"01:58:03",86.304536261196162,"",0,"",0,"",0,"",0,2,92.438364864490637]
[34,"Beverley Tucker",{"$f":"IFERROR(VLOOKUP(B36,INDIRECT(\"'\"&$I$1&\"'!\"&\"$C$2:$H$200\"),2,FALSE),\"\")","v":"Mynydd Du"},{"$f":"IFERROR(VLOOKUP(B36,INDIRECT(\"'\"&$I$1&\"'!\"&\"$C$2:$H$200\"),3,FALSE),\"\")","v":"F"},{"$f":"IFERROR(VLOOKUP(B36,INDIRECT(\"'\"&$I$1&\"'!\"&\"$C$2:$H$200\"),4,FALSE),\"\")","v":"FV50"},{"$f":"SUM(LARGE((H36,J36,L36,N36,P36,R36),{1,2,3,4}))","v":182.38657256362364},"03:26:18",94.594318414060893,4.3659722222222221,87.792254149562737,"",0,"",0,"",0,"",0,"",0,2,91.193286281811822]
[35,"Andy Stott",{"$f":"IFERROR(VLOOKUP(B37,INDIRECT(\"'\"&$K$1&\"'!\"&\"$C$2:$H$200\"),2,FALSE),\"\")","v":"MDC"},{"$f":"IFERROR(VLOOKUP(B37,INDIRECT(\"'\"&$K$1&\"'!\"&\"$C$2:$H$200\"),3,FALSE),\"\")","v":"M"},{"$f":"IFERROR(VLOOKUP(B37,INDIRECT(\"'\"&$K$1&\"'!\"&\"$C$2:$H$200\"),4,FALSE),\"\")","v":"M50"},{"$f":"SUM(LARGE((H37,J37,L37,N37,P37,R37),{1,2,3,4}))","v":180.34937828574715},"",0,4.0895833333333336,94.89559164733177,"01:58:56",85.453786638415366,"",0,"",0,"",0,"",0,2,90.174689142873575]
[36,"Rona Davies",{"$f":"IFERROR(VLOOKUP(B38,INDIRECT(\"'\"&$K$1&\"'!\"&\"$C$2:$H$200\"),2,FALSE),\"\")","v":"Mynydd Du"},{"$f":"IFERROR(VLOOKUP(B38,INDIRECT(\"'\"&$K$1&\"'!\"&\"$C$2:$H$200\"),3,FALSE),\"\")","v":"F"},{"$f":"IFERROR(VLOOKUP(B38,INDIRECT(\"'\"&$K$1&\"'!\"&\"$C$2:$H$200\"),4,FALSE),\"\")","v":"F50"},{"$f":"SUM(LARGE((H38,J38,L38,N38,P38,R38),{1,2,3,4}))","v":173.62379483200749},"",0,4.1826388888888895,92.504015705871836,"02:03:26",81.119779126135654,"",0,"",0,"",0,"",0,2,86.811897416003745]
[37,"Jim Jones",{"$f":"IFERROR(VLOOKUP(B39,INDIRECT(\"'\"&$I$1&\"'!\"&\"$C$2:$H$200\"),2,FALSE),\"\")","v":"Helsby Running Club"},{"$f":"IFERROR(VLOOKUP(B39,INDIRECT(\"'\"&$I$1&\"'!\"&\"$C$2:$H$200\"),3,FALSE),\"\")","v":"M"},{"$f":"IFERROR(VLOOKUP(B39,INDIRECT(\"'\"&$I$1&\"'!\"&\"$C$2:$H$200\"),4,FALSE),\"\")","v":"MV50"},{"$f":"SUM(LARGE((H39,J39,L39,N39,P39,R39),{1,2,3,4}))","v":171.54836294002618},"03:45:25",84.82696368962462,4.4076388888888891,86.721399250401561,"",0,"",0,"",0,"",0,"",0,2,85.77418147001309]
[38,"Andrew Chambers",{"$f":"IFERROR(VLOOKUP(B40,INDIRECT(\"'\"&$I$1&\"'!\"&\"$C$2:$H$200\"),2,FALSE),\"\")","v":0},{"$f":"IFERROR(VLOOKUP(B40,INDIRECT(\"'\"&$I$1&\"'!\"&\"$C$2:$H$200\"),3,FALSE),\"\")","v":"M"},{"$f":"IFERROR(VLOOKUP(B40,INDIRECT(\"'\"&$I$1&\"'!\"&\"$C$2:$H$200\"),4,FALSE),\"\")","v":"MV40"},{"$f":"SUM(LARGE((H40,J40,L40,N40,P40,R40),{1,2,3,4}))","v":166.9441440362942},"03:48:21",83.328223993460028,4.5284722222222227,83.615920042834176,"",0,"",0,"",0,"",0,"",0,2,83.472072018147102]
[39,"Karen Elvers",{"$f":"IFERROR(VLOOKUP(B41,INDIRECT(\"'\"&$K$1&\"'!\"&\"$C$2:$H$200\"),2,FALSE),\"\")","v":"MDC"},{"$f":"IFERROR(VLOOKUP(B41,INDIRECT(\"'\"&$K$1&\"'!\"&\"$C$2:$H$200\"),3,FALSE),\"\")","v":"F"},{"$f":"IFERROR(VLOOKUP(B41,INDIRECT(\"'\"&$K$1&\"'!\"&\"$C$2:$H$200\"),4,FALSE),\"\")","v":"F40"},{"$f":"SUM(LARGE((H41,J41,L41,N41,P41,R41),{1,2,3,4}))","v":153.60978823348597},"03:46:00",84.528918863682804,"",0,"02:15:56",69.080869369803182,"",0,"",0,"",0,"",0,2,76.804894116742986]
[40,"Janet Richards",{"$f":"IFERROR(VLOOKUP(B42,INDIRECT(\"'\"&$I$1&\"'!\"&\"$C$2:$H$200\"),2,FALSE),\"\")","v":"Mynydd Du"},{"$f":"IFERROR(VLOOKUP(B42,INDIRECT(\"'\"&$I$1&\"'!\"&\"$C$2:$H$200\"),3,FALSE),\"\")","v":"F"},{"$f":"IFERROR(VLOOKUP(B42,INDIRECT(\"'\"&$I$1&\"'!\"&\"$C$2:$H$200\"),4,FALSE),\"\")","v":"FV50"},{"$f":"SUM(LARGE((H42,J42,L42,N42,P42,R42),{1,2,3,4}))","v":153.06288100966611},"04:02:00",76.353975066421427,4.7972222222222225,76.708905943244687,"",0,"",0,"",0,"",0,"",0,2,76.531440504833057]
[41,"Charlie Lowther",{"$f":"IFERROR(VLOOKUP(B43,INDIRECT(\"'\"&$G$1&\"'!\"&\"$C$2:$H$200\"),2,FALSE),\"\")","v":"Mynydd Du"},{"$f":"IFERROR(VLOOKUP(B43,INDIRECT(\"'\"&$G$1&\"'!\"&\"$C$2:$H$200\"),3,FALSE),\"\")","v":"M"},{"$f":"IFERROR(VLOOKUP(B43,INDIRECT(\"'\"&$G$1&\"'!\"&\"$C$2:$H$200\"),4,FALSE),\"\")","v":"V40"},{"$f":"SUM(LARGE((H43,J43,L43,N43,P43,R43),{1,2,3,4}))","v":131.34750323591524},"02:14:22",131.34750323591524,"",0,"",0,"",0,"",0,"",0,"",0,1,131.34750323591524]
[42,"Hugh Aggleton",{"$f":"IFERROR(VLOOKUP(B44,INDIRECT(\"'\"&$G$1&\"'!\"&\"$C$2:$H$200\"),2,FALSE),\"\")","v":"MDC"},{"$f":"IFERROR(VLOOKUP(B44,INDIRECT(\"'\"&$G$1&\"'!\"&\"$C$2:$H$200\"),3,FALSE),\"\")","v":"M"},{"$f":"IFERROR(VLOOKUP(B44,INDIRECT(\"'\"&$G$1&\"'!\"&\"$C$2:$H$200\"),4,FALSE),\"\")","v":"Open"},{"$f":"SUM(LARGE((H44,J44,L44,N44,P44,R44),{1,2,3,4}))","v":130.77696028339804},"02:15:29",130.77696028339804,"",0,"",0,"",0,"",0,"",0,"",0,1,130.77696028339804]
[43,"Mark Hopkinson",{"$f":"IFERROR(VLOOKUP(B45,INDIRECT(\"'\"&$I$1&\"'!\"&\"$C$2:$H$200\"),2,FALSE),\"\")","v":"Mynydd Du "},{"$f":"IFERROR(VLOOKUP(B45,INDIRECT(\"'\"&$I$1&\"'!\"&\"$C$2:$H$200\"),3,FALSE),\"\")","v":"M"},{"$f":"IFERROR(VLOOKUP(B45,INDIRECT(\"'\"&$I$1&\"'!\"&\"$C$2:$H$200\"),4,FALSE),\"\")","v":"SM"},{"$f":"SUM(LARGE((H45,J45,L45,N45,P45,R45),{1,2,3,4}))","v":127.77083705157951},"",0,2.8104166666666668,127.77083705157951,"",0,"",0,"",0,"",0,"",0,1,127.77083705157951]
[44,"Sam Tosh",{"$f":"IFERROR(VLOOKUP(B46,INDIRECT(\"'\"&$K$1&\"'!\"&\"$C$2:$H$200\"),2,FALSE),\"\")","v":"Rossendale H"},{"$f":"IFERROR(VLOOKUP(B46,INDIRECT(\"'\"&$K$1&\"'!\"&\"$C$2:$H$200\"),3,FALSE),\"\")","v":"M"},{"$f":"IFERROR(VLOOKUP(B46,INDIRECT(\"'\"&$K$1&\"'!\"&\"$C$2:$H$200\"),4,FALSE),\"\")","v":"SM"},{"$f":"SUM(LARGE((H46,J46,L46,N46,P46,R46),{1,2,3,4}))","v":125.32665575138849},"",0,"",0,"01:17:32",125.32665575138849,"",0,"",0,"",0,"",0,1,125.32665575138849]
[45,"Alec Hough",{"$f":"IFERROR(VLOOKUP(B47,INDIRECT(\"'\"&$I$1&\"'!\"&\"$C$2:$H$200\"),2,FALSE),\"\")","v":"Mercia fell runners"},{"$f":"IFERROR(VLOOKUP(B47,INDIRECT(\"'\"&$I$1&\"'!\"&\"$C$2:$H$200\"),3,FALSE),\"\")","v":"M"},{"$f":"IFERROR(VLOOKUP(B47,INDIRECT(\"'\"&$I$1&\"'!\"&\"$C$2:$H$200\"),4,FALSE),\"\")","v":"SM"},{"$f":"SUM(LARGE((H47,J47,L47,N47,P47,R47),{1,2,3,4}))","v":124.54042477244332},"",0,2.9361111111111113,124.54042477244332,"",0,"",0,"",0,"",0,"",0,1,124.54042477244332]
[46,"Richard Roberts",{"$f":"IFERROR(VLOOKUP(B48,INDIRECT(\"'\"&$G$1&\"'!\"&\"$C$2:$H$200\"),2,FALSE),\"\")","v":"Eryri Harriers"},{"$f":"IFERROR(VLOOKUP(B48,INDIRECT(\"'\"&$G$1&\"'!\"&\"$C$2:$H$200\"),3,FALSE),\"\")","v":"M"},{"$f":"IFERROR(VLOOKUP(B48,INDIRECT(\"'\"&$G$1&\"'!\"&\"$C$2:$H$200\"),4,FALSE),\"\")","v":"Open"},{"$f":"SUM(LARGE((H48,J48,L48,N48,P48,R48),{1,2,3,4}))","v":123.94747598610259},"02:28:51",123.94747598610259,"",0,"",0,"",0,"",0,"",0,"",0,1,123.94747598610259]
[47,"Jez Brown","Buckley Runners","M","V40",{"$f":"SUM(LARGE((H49,J49,L49,N49,P49,R49),{1,2,3,4}))","v":123.8112269228149},"02:29:07",123.8112269228149,"",0,"",0,"",0,"",0,"",0,"",0,1,123.8112269228149]
[48,"Martin Humphreys","Stroud AC","M","V40",{"$f":"SUM(LARGE((H50,J50,L50,N50,P50,R50),{1,2,3,4}))","v":123.79419578990394},"02:29:09",123.79419578990394,"",0,"",0,"",0,"",0,"",0,"",0,1,123.79419578990394]
[49,"Andrew Salt","Croft Ambrey","M","Open",{"$f":"SUM(LARGE((H51,J51,L51,N51,P51,R51),{1,2,3,4}))","v":122.67014101778048},"02:31:21",122.67014101778048,"",0,"",0,"",0,"",0,"",0,"",0,1,122.67014101778048]
[50,"Stuart Bellamy","Mercia Fell Runners","M","V40",{"$f":"SUM(LARGE((H52,J52,L52,N52,P52,R52),{1,2,3,4}))","v":122.61053205259213},"02:31:28",122.61053205259213,"",0,"",0,"",0,"",0,"",0,"",0,1,122.61053205259213]
[51,"Iestyn Awesome Rhodes","Mynydd Du","M","V40",{"$f":"SUM(LARGE((H53,J53,L53,N53,P53,R53),{1,2,3,4}))","v":122.47428298930446},"02:31:44",122.47428298930446,"",0,"",0,"",0,"",0,"",0,"",0,1,122.47428298930446]
[52,"Pete Ryder",{"$f":"IFERROR(VLOOKUP(B54,INDIRECT(\"'\"&$K$1&\"'!\"&\"$C$2:$H$200\"),2,FALSE),\"\")","v":"Aberdare"},{"$f":"IFERROR(VLOOKUP(B54,INDIRECT(\"'\"&$K$1&\"'!\"&\"$C$2:$H$200\"),3,FALSE),\"\")","v":"M"},{"$f":"IFERROR(VLOOKUP(B54,INDIRECT(\"'\"&$K$1&\"'!\"&\"$C$2:$H$200\"),4,FALSE),\"\")","v":"SM"},{"$f":"SUM(LARGE((H54,J54,L54,N54,P54,R54),{1,2,3,4}))","v":121.92365726026517},"",0,"",0,"01:21:04",121.92365726026517,"",0,"",0,"",0,"",0,1,121.92365726026517]
[53,"James Blore",{"$f":"IFERROR(VLOOKUP(B55,INDIRECT(\"'\"&$I$1&\"'!\"&\"$C$2:$H$200\"),2,FALSE),\"\")","v":"MDC"},{"$f":"IFERROR(VLOOKUP(B55,INDIRECT(\"'\"&$I$1&\"'!\"&\"$C$2:$H$200\"),3,FALSE),\"\")","v":"M"},{"$f":"IFERROR(VLOOKUP(B55,INDIRECT(\"'\"&$I$1&\"'!\"&\"$C$2:$H$200\"),4,FALSE),\"\")","v":"SM"},{"$f":"SUM(LARGE((H55,J55,L55,N55,P55,R55),{1,2,3,4}))","v":121.84543994288775},"",0,3.0409722222222224,121.84543994288775,"",0,"",0,"",0,"",0,"",0,1,121.84543994288775]
[54,"Evan Davies",{"$f":"IFERROR(VLOOKUP(B56,INDIRECT(\"'\"&$G$1&\"'!\"&\"$C$2:$H$200\"),2,FALSE),\"\")","v":"Mynydd Du"},{"$f":"IFERROR(VLOOKUP(B56,INDIRECT(\"'\"&$G$1&\"'!\"&\"$C$2:$H$200\"),3,FALSE),\"\")","v":"M"},{"$f":"IFERROR(VLOOKUP(B56,INDIRECT(\"'\"&$G$1&\"'!\"&\"$C$2:$H$200\"),4,FALSE),\"\")","v":"U23"},{"$f":"SUM(LARGE((H56,J56,L56,N56,P56,R56),{1,2,3,4}))","v":120.64343620137609},"02:35:19",120.64343620137609,"",0,"",0,"",0,"",0,"",0,"",0,1,120.64343620137609]
[55,"Andrew Stephens",{"$f":"IFERROR(VLOOKUP(B57,INDIRECT(\"'\"&$G$1&\"'!\"&\"$C$2:$H$200\"),2,FALSE),\"\")","v":"Monross Trailblazers"},{"$f":"IFERROR(VLOOKUP(B57,INDIRECT(\"'\"&$G$1&\"'!\"&\"$C$2:$H$200\"),3,FALSE),\"\")","v":"M"},{"$f":"IFERROR(VLOOKUP(B57,INDIRECT(\"'\"&$G$1&\"'!\"&\"$C$2:$H$200\"),4,FALSE),\"\")","v":"V40"},{"$f":"SUM(LARGE((H57,J57,L57,N57,P57,R57),{1,2,3,4}))","v":120.53273383745487},"02:35:32",120.53273383745487,"",0,"",0,"",0,"",0,"",0,"",0,1,120.53273383745487]
[56,"Oliver Blomfield",{"$f":"IFERROR(VLOOKUP(B58,INDIRECT(\"'\"&$G$1&\"'!\"&\"$C$2:$H$200\"),2,FALSE),\"\")","v":"Eden Runners"},{"$f":"IFERROR(VLOOKUP(B58,INDIRECT(\"'\"&$G$1&\"'!\"&\"$C$2:$H$200\"),3,FALSE),\"\")","v":"M"},{"$f":"IFERROR(VLOOKUP(B58,INDIRECT(\"'\"&$G$1&\"'!\"&\"$C$2:$H$200\"),4,FALSE),\"\")","v":"V40"},{"$f":"SUM(LARGE((H58,J58,L58,N58,P58,R58),{1,2,3,4}))","v":118.53157572041692},"02:39:27",118.53157572041692,"",0,"",0,"",0,"",0,"",0,"",0,1,118.53157572041692]
[57,"Stephen Jones",{"$f":"IFERROR(VLOOKUP(B59,INDIRECT(\"'\"&$G$1&\"'!\"&\"$C$2:$H$200\"),2,FALSE),\"\")","v":"Eryri Harriers"},{"$f":"IFERROR(VLOOKUP(B59,INDIRECT(\"'\"&$G$1&\"'!\"&\"$C$2:$H$200\"),3,FALSE),\"\")","v":"M"},{"$f":"IFERROR(VLOOKUP(B59,INDIRECT(\"'\"&$G$1&\"'!\"&\"$C$2:$H$200\"),4,FALSE),\"\")","v":"V60"},{"$f":"SUM(LARGE((H59,J59,L59,N59,P59,R59),{1,2,3,4}))","v":118.49751345459501},"02:39:31",118.49751345459501,"",0,"",0,"",0,"",0,"",0,"",0,1,118.49751345459501]
[58,"Jim Masters",{"$f":"IFERROR(VLOOKUP(B60,INDIRECT(\"'\"&$I$1&\"'!\"&\"$C$2:$H$200\"),2,FALSE),\"\")","v":"Wye Valley Runners"},{"$f":"IFERROR(VLOOKUP(B60,INDIRECT(\"'\"&$I$1&\"'!\"&\"$C$2:$H$200\"),3,FALSE),\"\")","v":"M"},{"$f":"IFERROR(VLOOKUP(B60,INDIRECT(\"'\"&$I$1&\"'!\"&\"$C$2:$H$200\"),4,FALSE),\"\")","v":"MV40"},{"$f":"SUM(LARGE((H60,J60,L60,N60,P60,R60),{1,2,3,4}))","v":118.34731393896125},"",0,3.1770833333333335,118.34731393896125,"",0,"",0,"",0,"",0,"",0,1,118.34731393896125]
[59,"Leon Davies",{"$f":"IFERROR(VLOOKUP(B61,INDIRECT(\"'\"&$G$1&\"'!\"&\"$C$2:$H$200\"),2,FALSE),\"\")","v":"NWRRC"},{"$f":"IFERROR(VLOOKUP(B61,INDIRECT(\"'\"&$G$1&\"'!\"&\"$C$2:$H$200\"),3,FALSE),\"\")","v":"M"},{"$f":"IFERROR(VLOOKUP(B61,INDIRECT(\"'\"&$G$1&\"'!\"&\"$C$2:$H$200\"),4,FALSE),\"\")","v":"V40"},{"$f":"SUM(LARGE((H61,J61,L61,N61,P61,R61),{1,2,3,4}))","v":117.49267661284826},"02:41:29",117.49267661284826,"",0,"",0,"",0,"",0,"",0,"",0,1,117.49267661284826]
[60,"Andy Davies",{"$f":"IFERROR(VLOOKUP(B62,INDIRECT(\"'\"&$G$1&\"'!\"&\"$C$2:$H$200\"),2,FALSE),\"\")","v":"Mercia"},{"$f":"IFERROR(VLOOKUP(B62,INDIRECT(\"'\"&$G$1&\"'!\"&\"$C$2:$H$200\"),3,FALSE),\"\")","v":"M"},{"$f":"IFERROR(VLOOKUP(B62,INDIRECT(\"'\"&$G$1&\"'!\"&\"$C$2:$H$200\"),4,FALSE),\"\")","v":"V50"},{"$f":"SUM(LARGE((H62,J62,L62,N62,P62,R62),{1,2,3,4}))","v":117.29681858437222},"02:41:52",117.29681858437222,"",0,"",0,"",0,"",0,"",0,"",0,1,117.29681858437222]
[61,"Craig Jones",{"$f":"IFERROR(VLOOKUP(B63,INDIRECT(\"'\"&$G$1&\"'!\"&\"$C$2:$H$200\"),2,FALSE),\"\")","v":"Eryri Harriers"},{"$f":"IFERROR(VLOOKUP(B63,INDIRECT(\"'\"&$G$1&\"'!\"&\"$C$2:$H$200\"),3,FALSE),\"\")","v":"M"},{"$f":"IFERROR(VLOOKUP(B63,INDIRECT(\"'\"&$G$1&\"'!\"&\"$C$2:$H$200\"),4,FALSE),\"\")","v":"V40"},{"$f":"SUM(LARGE((H63,J63,L63,N63,P63,R63),{1,2,3,4}))","v":117.04135159070781},"02:42:22",117.04135159070781,"",0,"",0,"",0,"",0,"",0,"",0,1,117.04135159070781]
[62,"Jack Agnew",{"$f":"IFERROR(VLOOKUP(B64,INDIRECT(\"'\"&$K$1&\"'!\"&\"$C$2:$H$200\"),2,FALSE),\"\")","v":"Mercia"},{"$f":"IFERROR(VLOOKUP(B64,INDIRECT(\"'\"&$K$1&\"'!\"&\"$C$2:$H$200\"),3,FALSE),\"\")","v":"M"},{"$f":"IFERROR(VLOOKUP(B64,INDIRECT(\"'\"&$K$1&\"'!\"&\"$C$2:$H$200\"),4,FALSE),\"\")","v":"U23"},{"$f":"SUM(LARGE((H64,J64,L64,N64,P64,R64),{1,2,3,4}))","v":116.57838132845357},"",0,"",0,"01:26:37",116.57838132845357,"",0,"",0,"",0,"",0,1,116.57838132845357]
[63,"Katie Ironside",{"$f":"IFERROR(VLOOKUP(B65,INDIRECT(\"'\"&$G$1&\"'!\"&\"$C$2:$H$200\"),2,FALSE),\"\")","v":"MDC"},{"$f":"IFERROR(VLOOKUP(B65,INDIRECT(\"'\"&$G$1&\"'!\"&\"$C$2:$H$200\"),3,FALSE),\"\")","v":"F"},{"$f":"IFERROR(VLOOKUP(B65,INDIRECT(\"'\"&$G$1&\"'!\"&\"$C$2:$H$200\"),4,FALSE),\"\")","v":"Open"},{"$f":"SUM(LARGE((H65,J65,L65,N65,P65,R65),{1,2,3,4}))","v":115.44042509707747},"02:45:30",115.44042509707747,"",0,"",0,"",0,"",0,"",0,"",0,1,115.44042509707747]
[64,"Ian Whitstance",{"$f":"IFERROR(VLOOKUP(B66,INDIRECT(\"'\"&$G$1&\"'!\"&\"$C$2:$H$200\"),2,FALSE),\"\")","v":"Mynydd Du"},{"$f":"IFERROR(VLOOKUP(B66,INDIRECT(\"'\"&$G$1&\"'!\"&\"$C$2:$H$200\"),3,FALSE),\"\")","v":"M"},{"$f":"IFERROR(VLOOKUP(B66,INDIRECT(\"'\"&$G$1&\"'!\"&\"$C$2:$H$200\"),4,FALSE),\"\")","v":"V40"},{"$f":"SUM(LARGE((H66,J66,L66,N66,P66,R66),{1,2,3,4}))","v":115.14238027113564},"02:46:05",115.14238027113564,"",0,"",0,"",0,"",0,"",0,"",0,1,115.14238027113564]
[65,"Andy Stephens",{"$f":"IFERROR(VLOOKUP(B67,INDIRECT(\"'\"&$K$1&\"'!\"&\"$C$2:$H$200\"),2,FALSE),\"\")","v":"Monross"},{"$f":"IFERROR(VLOOKUP(B67,INDIRECT(\"'\"&$K$1&\"'!\"&\"$C$2:$H$200\"),3,FALSE),\"\")","v":"M"},{"$f":"IFERROR(VLOOKUP(B67,INDIRECT(\"'\"&$K$1&\"'!\"&\"$C$2:$H$200\"),4,FALSE),\"\")","v":"M40"},{"$f":"SUM(LARGE((H67,J67,L67,N67,P67,R67),{1,2,3,4}))","v":115.06950463899321},{"$f":"IFERROR(VLOOKUP(B67,INDIRECT(\"'\"&$G$1&\"'!\"&\"$C$2:$H$200\"),5,FALSE),\"\")","v":""},{"$f":"IFERROR(VLOOKUP(B67,INDIRECT(\"'\"&$G$1&\"'!\"&\"$C$2:$H$200\"),6,FALSE),0)","v":0},{"$f":"IFERROR(VLOOKUP(B67,INDIRECT(\"'\"&$I$1&\"'!\"&\"$C$2:$G$200\"),5,FALSE),\"\")","v":""},{"$f":"IFERROR(VLOOKUP(B67,INDIRECT(\"'\"&$I$1&\"'!\"&\"$C$2:$H$200\"),6,FALSE),0)","v":0},{"$f":"IFERROR(VLOOKUP(B67,INDIRECT(\"'\"&$K$1&\"'!\"&\"$C$2:$H$200\"),5,FALSE),\"\")","v":"01:28:11"},{"$f":"IFERROR(VLOOKUP(B67,INDIRECT(\"'\"&$K$1&\"'!\"&\"$C$2:$H$200\"),6,FALSE),0)","v":115.06950463899321},{"$f":"IFERROR(VLOOKUP(B67,INDIRECT(\"'\"&$M$1&\"'!\"&\"$C$2:$h$200\"),5,FALSE),\"\")","v":""},{"$f":"IFERROR(VLOOKUP(B67,INDIRECT(\"'\"&$M$1&\"'!\"&\"$C$2:$h$200\"),6,FALSE),0)","v":0},{"$f":"IFERROR(VLOOKUP(B67,INDIRECT(\"'\"&$O$1&\"'!\"&\"$C$2:$h$200\"),5,FALSE),\"\")","v":""},{"$f":"IFERROR(VLOOKUP(B67,INDIRECT(\"'\"&$O$1&\"'!\"&\"$C$2:$h$200\"),6,FALSE),0)","v":0},{"$f":"IFERROR(VLOOKUP(B67,INDIRECT(\"'\"&$Q$1&\"'!\"&\"$C$2:$h$200\"),5,FALSE),\"\")","v":""},{"$f":"IFERROR(VLOOKUP(B67,INDIRECT(\"'\"&$Q$1&\"'!\"&\"$C$2:$h$200\"),6,FALSE),0)","v":0},{"$f":"IFERROR(VLOOKUP(D67,INDIRECT(\"'\"&$Q$1&\"'!\"&\"$C$2:$h$200\"),5,FALSE),\"\")","v":""},{"$f":"IFERROR(VLOOKUP(D67,INDIRECT(\"'\"&$S$1&\"'!\"&\"$C$2:$h$200\"),6,FALSE),0)","v":0},{"$f":"7-COUNTIF(G67:T67,\"\")","v":1},{"$f":"F67/IF(U67>4,4,U67)","v":115.06950463899321}]
[{"$f":"ROW(A66)","v":66},"Chris Chambers",{"$f":"IFERROR(VLOOKUP(B68,INDIRECT(\"'\"&$I$1&\"'!\"&\"$C$2:$H$200\"),2,FALSE),\"\")","v":"Mynydd Du"},{"$f":"IFERROR(VLOOKUP(B68,INDIRECT(\"'\"&$I$1&\"'!\"&\"$C$2:$H$200\"),3,FALSE),\"\")","v":"M"},{"$f":"IFERROR(VLOOKUP(B68,INDIRECT(\"'\"&$I$1&\"'!\"&\"$C$2:$H$200\"),4,FALSE),\"\")","v":"MV40"},{"$f":"SUM(LARGE((H68,J68,L68,N68,P68,R68),{1,2,3,4}))","v":114.81349277172943},"",0,3.3145833333333332,114.81349277172943,"",0,"",0,"",0,"",0,"",0,1,114.81349277172943]
[67,"Mark Edward Hopkinson",{"$f":"IFERROR(VLOOKUP(B69,INDIRECT(\"'\"&$G$1&\"'!\"&\"$C$2:$H$200\"),2,FALSE),\"\")","v":"Mymydd Du"},{"$f":"IFERROR(VLOOKUP(B69,INDIRECT(\"'\"&$G$1&\"'!\"&\"$C$2:$H$200\"),3,FALSE),\"\")","v":"M"},{"$f":"IFERROR(VLOOKUP(B69,INDIRECT(\"'\"&$G$1&\"'!\"&\"$C$2:$H$200\"),4,FALSE),\"\")","v":"Open"},{"$f":"SUM(LARGE((H69,J69,L69,N69,P69,R69),{1,2,3,4}))","v":114.73363308127256},"02:46:53",114.73363308127256,"",0,"",0,"",0,"",0,"",0,"",0,1,114.73363308127256]
[68,"Toby Dickens",{"$f":"IFERROR(VLOOKUP(B70,INDIRECT(\"'\"&$G$1&\"'!\"&\"$C$2:$H$200\"),2,FALSE),\"\")","v":"Monross Trailblazers"},{"$f":"IFERROR(VLOOKUP(B70,INDIRECT(\"'\"&$G$1&\"'!\"&\"$C$2:$H$200\"),3,FALSE),\"\")","v":"M"},{"$f":"IFERROR(VLOOKUP(B70,INDIRECT(\"'\"&$G$1&\"'!\"&\"$C$2:$H$200\"),4,FALSE),\"\")","v":"U23"},{"$f":"SUM(LARGE((H70,J70,L70,N70,P70,R70),{1,2,3,4}))","v":114.4185571224198},"02:47:30",114.4185571224198,"",0,"",0,"",0,"",0,"",0,"",0,1,114.4185571224198]
[69,"james brown",{"$f":"IFERROR(VLOOKUP(B71,INDIRECT(\"'\"&$I$1&\"'!\"&\"$C$2:$H$200\"),2,FALSE),\"\")","v":0},{"$f":"IFERROR(VLOOKUP(B71,INDIRECT(\"'\"&$I$1&\"'!\"&\"$C$2:$H$200\"),3,FALSE),\"\")","v":"M"},{"$f":"IFERROR(VLOOKUP(B71,INDIRECT(\"'\"&$I$1&\"'!\"&\"$C$2:$H$200\"),4,FALSE),\"\")","v":"SM"},{"$f":"SUM(LARGE((H71,J71,L71,N71,P71,R71),{1,2,3,4}))","v":114.08174192396929},"",0,3.3430555555555554,114.08174192396929,"",0,"",0,"",0,"",0,"",0,1,114.08174192396929]
[70,"Robert Pritchard",{"$f":"IFERROR(VLOOKUP(B72,INDIRECT(\"'\"&$G$1&\"'!\"&\"$C$2:$H$200\"),2,FALSE),\"\")","v":"Monross Trailblazers"},{"$f":"IFERROR(VLOOKUP(B72,INDIRECT(\"'\"&$G$1&\"'!\"&\"$C$2:$H$200\"),3,FALSE),\"\")","v":"M"},{"$f":"IFERROR(VLOOKUP(B72,INDIRECT(\"'\"&$G$1&\"'!\"&\"$C$2:$H$200\"),4,FALSE),\"\")","v":"Open"},{"$f":"SUM(LARGE((H72,J72,L72,N72,P72,R72),{1,2,3,4}))","v":113.77988963825874},"02:48:45",113.77988963825874,"",0,"",0,"",0,"",0,"",0,"",0,1,113.77988963825874]
[71,"Sam Rayall",{"$f":"IFERROR(VLOOKUP(B73,INDIRECT(\"'\"&$G$1&\"'!\"&\"$C$2:$H$200\"),2,FALSE),\"\")","v":"Pontypridd Roadents"},{"$f":"IFERROR(VLOOKUP(B73,INDIRECT(\"'\"&$G$1&\"'!\"&\"$C$2:$H$200\"),3,FALSE),\"\")","v":"M"},{"$f":"IFERROR(VLOOKUP(B73,INDIRECT(\"'\"&$G$1&\"'!\"&\"$C$2:$H$200\"),4,FALSE),\"\")","v":"V40"},{"$f":"SUM(LARGE((H73,J73,L73,N73,P73,R73),{1,2,3,4}))","v":113.74582737243682},"02:48:49",113.74582737243682,"",0,"",0,"",0,"",0,"",0,"",0,1,113.74582737243682]
[72,"Gethin Powell",{"$f":"IFERROR(VLOOKUP(B74,INDIRECT(\"'\"&$I$1&\"'!\"&\"$C$2:$H$200\"),2,FALSE),\"\")","v":"Pontypridd Roadents Ac"},{"$f":"IFERROR(VLOOKUP(B74,INDIRECT(\"'\"&$I$1&\"'!\"&\"$C$2:$H$200\"),3,FALSE),\"\")","v":"M"},{"$f":"IFERROR(VLOOKUP(B74,INDIRECT(\"'\"&$I$1&\"'!\"&\"$C$2:$H$200\"),4,FALSE),\"\")","v":"SM"},{"$f":"SUM(LARGE((H74,J74,L74,N74,P74,R74),{1,2,3,4}))","v":113.58200963769409},"",0,3.3625000000000003,113.58200963769409,"",0,"",0,"",0,"",0,"",0,1,113.58200963769409]
[73,"Tim Woodier",{"$f":"IFERROR(VLOOKUP(B75,INDIRECT(\"'\"&$G$1&\"'!\"&\"$C$2:$H$200\"),2,FALSE),\"\")","v":"Mynydd Du"},{"$f":"IFERROR(VLOOKUP(B75,INDIRECT(\"'\"&$G$1&\"'!\"&\"$C$2:$H$200\"),3,FALSE),\"\")","v":"M"},{"$f":"IFERROR(VLOOKUP(B75,INDIRECT(\"'\"&$G$1&\"'!\"&\"$C$2:$H$200\"),4,FALSE),\"\")","v":"Open"},{"$f":"SUM(LARGE((H75,J75,L75,N75,P75,R75),{1,2,3,4}))","v":112.63028816676885},"02:51:00",112.63028816676885,"",0,"",0,"",0,"",0,"",0,"",0,1,112.63028816676885]
[74,"Anthony Powell",{"$f":"IFERROR(VLOOKUP(B76,INDIRECT(\"'\"&$G$1&\"'!\"&\"$C$2:$H$200\"),2,FALSE),\"\")","v":"Maldwyn Harriers"},{"$f":"IFERROR(VLOOKUP(B76,INDIRECT(\"'\"&$G$1&\"'!\"&\"$C$2:$H$200\"),3,FALSE),\"\")","v":"M"},{"$f":"IFERROR(VLOOKUP(B76,INDIRECT(\"'\"&$G$1&\"'!\"&\"$C$2:$H$200\"),4,FALSE),\"\")","v":"V40"},{"$f":"SUM(LARGE((H76,J76,L76,N76,P76,R76),{1,2,3,4}))","v":112.52810136930309},"02:51:12",112.52810136930309,"",0,"",0,"",0,"",0,"",0,"",0,1,112.52810136930309]
[75,"Wyndham Turner",{"$f":"IFERROR(VLOOKUP(B77,INDIRECT(\"'\"&$K$1&\"'!\"&\"$C$2:$H$200\"),2,FALSE),\"\")","v":0},{"$f":"IFERROR(VLOOKUP(B77,INDIRECT(\"'\"&$K$1&\"'!\"&\"$C$2:$H$200\"),3,FALSE),\"\")","v":"M"},{"$f":"IFERROR(VLOOKUP(B77,INDIRECT(\"'\"&$K$1&\"'!\"&\"$C$2:$H$200\"),4,FALSE),\"\")","v":"M"},{"$f":"SUM(LARGE((H77,J77,L77,N77,P77,R77),{1,2,3,4}))","v":112.46910013162541},"",0,"",0,"01:30:53",112.46910013162541,"",0,"",0,"",0,"",0,1,112.46910013162541]
[76,"Sian Williams",{"$f":"IFERROR(VLOOKUP(B78,INDIRECT(\"'\"&$G$1&\"'!\"&\"$C$2:$H$200\"),2,FALSE),\"\")","v":"Hebog"},{"$f":"IFERROR(VLOOKUP(B78,INDIRECT(\"'\"&$G$1&\"'!\"&\"$C$2:$H$200\"),3,FALSE),\"\")","v":"F"},{"$f":"IFERROR(VLOOKUP(B78,INDIRECT(\"'\"&$G$1&\"'!\"&\"$C$2:$H$200\"),4,FALSE),\"\")","v":"Open"},{"$f":"SUM(LARGE((H78,J78,L78,N78,P78,R78),{1,2,3,4}))","v":112.41739900538184},"02:51:25",112.41739900538184,"",0,"",0,"",0,"",0,"",0,"",0,1,112.41739900538184]
[77,"Mel Price",{"$f":"IFERROR(VLOOKUP(B79,INDIRECT(\"'\"&$K$1&\"'!\"&\"$C$2:$H$200\"),2,FALSE),\"\")","v":"Mercia"},{"$f":"IFERROR(VLOOKUP(B79,INDIRECT(\"'\"&$K$1&\"'!\"&\"$C$2:$H$200\"),3,FALSE),\"\")","v":"F"},{"$f":"IFERROR(VLOOKUP(B79,INDIRECT(\"'\"&$K$1&\"'!\"&\"$C$2:$H$200\"),4,FALSE),\"\")","v":"F40"},{"$f":"SUM(LARGE((H79,J79,L79,N79,P79,R79),{1,2,3,4}))","v":112.2764775755241},"",0,"",0,"01:31:05",112.2764775755241,"",0,"",0,"",0,"",0,1,112.2764775755241]
[78,"Gary Davies",{"$f":"IFERROR(VLOOKUP(B80,INDIRECT(\"'\"&$G$1&\"'!\"&\"$C$2:$H$200\"),2,FALSE),\"\")","v":"MDC"},{"$f":"IFERROR(VLOOKUP(B80,INDIRECT(\"'\"&$G$1&\"'!\"&\"$C$2:$H$200\"),3,FALSE),\"\")","v":"M"},{"$f":"IFERROR(VLOOKUP(B80,INDIRECT(\"'\"&$G$1&\"'!\"&\"$C$2:$H$200\"),4,FALSE),\"\")","v":"V40"},{"$f":"SUM(LARGE((H80,J80,L80,N80,P80,R80),{1,2,3,4}))","v":111.21670413515908},"02:53:46",111.21670413515908,"",0,"",0,"",0,"",0,"",0,"",0,1,111.21670413515908]
[79,"Andrew Han",{"$f":"IFERROR(VLOOKUP(B81,INDIRECT(\"'\"&$G$1&\"'!\"&\"$C$2:$H$200\"),2,FALSE),\"\")","v":"Fulham Running Club"},{"$f":"IFERROR(VLOOKUP(B81,INDIRECT(\"'\"&$G$1&\"'!\"&\"$C$2:$H$200\"),3,FALSE),\"\")","v":"M"},{"$f":"IFERROR(VLOOKUP(B81,INDIRECT(\"'\"&$G$1&\"'!\"&\"$C$2:$H$200\"),4,FALSE),\"\")","v":"Open"},{"$f":"SUM(LARGE((H81,J81,L81,N81,P81,R81),{1,2,3,4}))","v":111.06342393896043},"02:54:04",111.06342393896043,"",0,"",0,"",0,"",0,"",0,"",0,1,111.06342393896043]
[80,"Paul Beeson",{"$f":"IFERROR(VLOOKUP(B82,INDIRECT(\"'\"&$G$1&\"'!\"&\"$C$2:$H$200\"),2,FALSE),\"\")","v":"Maudwyn Harriers"},{"$f":"IFERROR(VLOOKUP(B82,INDIRECT(\"'\"&$G$1&\"'!\"&\"$C$2:$H$200\"),3,FALSE),\"\")","v":"M"},{"$f":"IFERROR(VLOOKUP(B82,INDIRECT(\"'\"&$G$1&\"'!\"&\"$C$2:$H$200\"),4,FALSE),\"\")","v":"V50"},{"$f":"SUM(LARGE((H82,J82,L82,N82,P82,R82),{1,2,3,4}))","v":110.75686354656311},"02:54:40",110.75686354656311,"",0,"",0,"",0,"",0,"",0,"",0,1,110.75686354656311]
[81,"Vincent Kamp",{"$f":"IFERROR(VLOOKUP(B83,INDIRECT(\"'\"&$I$1&\"'!\"&\"$C$2:$H$200\"),2,FALSE),\"\")","v":0},{"$f":"IFERROR(VLOOKUP(B83,INDIRECT(\"'\"&$I$1&\"'!\"&\"$C$2:$H$200\"),3,FALSE),\"\")","v":"M"},{"$f":"IFERROR(VLOOKUP(B83,INDIRECT(\"'\"&$I$1&\"'!\"&\"$C$2:$H$200\"),4,FALSE),\"\")","v":"MV40"},{"$f":"SUM(LARGE((H83,J83,L83,N83,P83,R83),{1,2,3,4}))","v":110.69070140995896},"",0,3.4750000000000001,110.69070140995896,"",0,"",0,"",0,"",0,"",0,1,110.69070140995896]
[82,"Nigeal Rogerson",{"$f":"IFERROR(VLOOKUP(B84,INDIRECT(\"'\"&$K$1&\"'!\"&\"$C$2:$H$200\"),2,FALSE),\"\")","v":0},{"$f":"IFERROR(VLOOKUP(B84,INDIRECT(\"'\"&$K$1&\"'!\"&\"$C$2:$H$200\"),3,FALSE),\"\")","v":"M"},{"$f":"IFERROR(VLOOKUP(B84,INDIRECT(\"'\"&$K$1&\"'!\"&\"$C$2:$H$200\"),4,FALSE),\"\")","v":"M40"},{"$f":"SUM(LARGE((H84,J84,L84,N84,P84,R84),{1,2,3,4}))","v":110.43051141288642},"",0,"",0,"01:33:00",110.43051141288642,"",0,"",0,"",0,"",0,1,110.43051141288642]
[83,"Ian Luke",{"$f":"IFERROR(VLOOKUP(B85,INDIRECT(\"'\"&$K$1&\"'!\"&\"$C$2:$H$200\"),2,FALSE),\"\")","v":"Poole R"},{"$f":"IFERROR(VLOOKUP(B85,INDIRECT(\"'\"&$K$1&\"'!\"&\"$C$2:$H$200\"),3,FALSE),\"\")","v":"M"},{"$f":"IFERROR(VLOOKUP(B85,INDIRECT(\"'\"&$K$1&\"'!\"&\"$C$2:$H$200\"),4,FALSE),\"\")","v":"M"},{"$f":"SUM(LARGE((H85,J85,L85,N85,P85,R85),{1,2,3,4}))","v":110.14157757873448},"",0,"",0,"01:33:18",110.14157757873448,"",0,"",0,"",0,"",0,1,110.14157757873448]
[84,"Jonny Woolridge",{"$f":"IFERROR(VLOOKUP(B86,INDIRECT(\"'\"&$I$1&\"'!\"&\"$C$2:$H$200\"),2,FALSE),\"\")","v":0},{"$f":"IFERROR(VLOOKUP(B86,INDIRECT(\"'\"&$I$1&\"'!\"&\"$C$2:$H$200\"),3,FALSE),\"\")","v":"M"},{"$f":"IFERROR(VLOOKUP(B86,INDIRECT(\"'\"&$I$1&\"'!\"&\"$C$2:$H$200\"),4,FALSE),\"\")","v":"SM"},{"$f":"SUM(LARGE((H86,J86,L86,N86,P86,R86),{1,2,3,4}))","v":110.06603605211494},"",0,3.4993055555555554,110.06603605211494,"",0,"",0,"",0,"",0,"",0,1,110.06603605211494]
[85,"Martin Wright",{"$f":"IFERROR(VLOOKUP(B87,INDIRECT(\"'\"&$G$1&\"'!\"&\"$C$2:$H$200\"),2,FALSE),\"\")","v":"Mynydd Du"},{"$f":"IFERROR(VLOOKUP(B87,INDIRECT(\"'\"&$G$1&\"'!\"&\"$C$2:$H$200\"),3,FALSE),\"\")","v":"M"},{"$f":"IFERROR(VLOOKUP(B87,INDIRECT(\"'\"&$G$1&\"'!\"&\"$C$2:$H$200\"),4,FALSE),\"\")","v":"V40"},{"$f":"SUM(LARGE((H87,J87,L87,N87,P87,R87),{1,2,3,4}))","v":110.05007153075823},"02:56:03",110.05007153075823,"",0,"",0,"",0,"",0,"",0,"",0,1,110.05007153075823]
[86,"Peter Nugent",{"$f":"IFERROR(VLOOKUP(B88,INDIRECT(\"'\"&$I$1&\"'!\"&\"$C$2:$H$200\"),2,FALSE),\"\")","v":"Wye Valley Runners"},{"$f":"IFERROR(VLOOKUP(B88,INDIRECT(\"'\"&$I$1&\"'!\"&\"$C$2:$H$200\"),3,FALSE),\"\")","v":"M"},{"$f":"IFERROR(VLOOKUP(B88,INDIRECT(\"'\"&$I$1&\"'!\"&\"$C$2:$H$200\"),4,FALSE),\"\")","v":"SM"},{"$f":"SUM(LARGE((H88,J88,L88,N88,P88,R88),{1,2,3,4}))","v":109.90540781724074},"",0,3.505555555555556,109.90540781724074,"",0,"",0,"",0,"",0,"",0,1,109.90540781724074]
[87,"Dan Lewis",{"$f":"IFERROR(VLOOKUP(B89,INDIRECT(\"'\"&$K$1&\"'!\"&\"$C$2:$H$200\"),2,FALSE),\"\")","v":"Wye V"},{"$f":"IFERROR(VLOOKUP(B89,INDIRECT(\"'\"&$K$1&\"'!\"&\"$C$2:$H$200\"),3,FALSE),\"\")","v":"M"},{"$f":"IFERROR(VLOOKUP(B89,INDIRECT(\"'\"&$K$1&\"'!\"&\"$C$2:$H$200\"),4,FALSE),\"\")","v":"M40"},{"$f":"SUM(LARGE((H89,J89,L89,N89,P89,R89),{1,2,3,4}))","v":109.01794600147676},"",0,"",0,"01:34:28",109.01794600147676,"",0,"",0,"",0,"",0,1,109.01794600147676]
[88,"Faye Johnson",{"$f":"IFERROR(VLOOKUP(B90,INDIRECT(\"'\"&$G$1&\"'!\"&\"$C$2:$H$200\"),2,FALSE),\"\")","v":"Mynydd Du"},{"$f":"IFERROR(VLOOKUP(B90,INDIRECT(\"'\"&$G$1&\"'!\"&\"$C$2:$H$200\"),3,FALSE),\"\")","v":"F"},{"$f":"IFERROR(VLOOKUP(B90,INDIRECT(\"'\"&$G$1&\"'!\"&\"$C$2:$H$200\"),4,FALSE),\"\")","v":"Open"},{"$f":"SUM(LARGE((H90,J90,L90,N90,P90,R90),{1,2,3,4}))","v":108.80679882825805},"02:58:29",108.80679882825805,"",0,"",0,"",0,"",0,"",0,"",0,1,108.80679882825805]
[89,"Michael Reynolds",{"$f":"IFERROR(VLOOKUP(B91,INDIRECT(\"'\"&$K$1&\"'!\"&\"$C$2:$H$200\"),2,FALSE),\"\")","v":"Mercia"},{"$f":"IFERROR(VLOOKUP(B91,INDIRECT(\"'\"&$K$1&\"'!\"&\"$C$2:$H$200\"),3,FALSE),\"\")","v":"M"},{"$f":"IFERROR(VLOOKUP(B91,INDIRECT(\"'\"&$K$1&\"'!\"&\"$C$2:$H$200\"),4,FALSE),\"\")","v":"M50"},{"$f":"SUM(LARGE((H91,J91,L91,N91,P91,R91),{1,2,3,4}))","v":108.79321968602524},"",0,"",0,"01:34:42",108.79321968602524,"",0,"",0,"",0,"",0,1,108.79321968602524]
[90,"Glyn Williams",{"$f":"IFERROR(VLOOKUP(B92,INDIRECT(\"'\"&$I$1&\"'!\"&\"$C$2:$H$200\"),2,FALSE),\"\")","v":"Croft Ambrey RC"},{"$f":"IFERROR(VLOOKUP(B92,INDIRECT(\"'\"&$I$1&\"'!\"&\"$C$2:$H$200\"),3,FALSE),\"\")","v":"M"},{"$f":"IFERROR(VLOOKUP(B92,INDIRECT(\"'\"&$I$1&\"'!\"&\"$C$2:$H$200\"),4,FALSE),\"\")","v":"MV40"},{"$f":"SUM(LARGE((H92,J92,L92,N92,P92,R92),{1,2,3,4}))","v":108.69177226485812},"",0,3.5527777777777776,108.69177226485812,"",0,"",0,"",0,"",0,"",0,1,108.69177226485812]
[91,"Vic Belshaw",{"$f":"IFERROR(VLOOKUP(B93,INDIRECT(\"'\"&$G$1&\"'!\"&\"$C$2:$H$200\"),2,FALSE),\"\")","v":"Denbigh Harriers"},{"$f":"IFERROR(VLOOKUP(B93,INDIRECT(\"'\"&$G$1&\"'!\"&\"$C$2:$H$200\"),3,FALSE),\"\")","v":"M"},{"$f":"IFERROR(VLOOKUP(B93,INDIRECT(\"'\"&$G$1&\"'!\"&\"$C$2:$H$200\"),4,FALSE),\"\")","v":"V50"},{"$f":"SUM(LARGE((H93,J93,L93,N93,P93,R93),{1,2,3,4}))","v":108.09149124599769},"02:59:53",108.09149124599769,"",0,"",0,"",0,"",0,"",0,"",0,1,108.09149124599769]
[92,"Alan Hughes",{"$f":"IFERROR(VLOOKUP(B94,INDIRECT(\"'\"&$G$1&\"'!\"&\"$C$2:$H$200\"),2,FALSE),\"\")","v":"Exeter Tri Club"},{"$f":"IFERROR(VLOOKUP(B94,INDIRECT(\"'\"&$G$1&\"'!\"&\"$C$2:$H$200\"),3,FALSE),\"\")","v":"M"},{"$f":"IFERROR(VLOOKUP(B94,INDIRECT(\"'\"&$G$1&\"'!\"&\"$C$2:$H$200\"),4,FALSE),\"\")","v":"V40"},{"$f":"SUM(LARGE((H94,J94,L94,N94,P94,R94),{1,2,3,4}))","v":108.01485114789836},"03:00:02",108.01485114789836,"",0,"",0,"",0,"",0,"",0,"",0,1,108.01485114789836]
[93,"Gary Pearson",{"$f":"IFERROR(VLOOKUP(B95,INDIRECT(\"'\"&$G$1&\"'!\"&\"$C$2:$H$200\"),2,FALSE),\"\")","v":"Croft Ambrey"},{"$f":"IFERROR(VLOOKUP(B95,INDIRECT(\"'\"&$G$1&\"'!\"&\"$C$2:$H$200\"),3,FALSE),\"\")","v":"M"},{"$f":"IFERROR(VLOOKUP(B95,INDIRECT(\"'\"&$G$1&\"'!\"&\"$C$2:$H$200\"),4,FALSE),\"\")","v":"V40"},{"$f":"SUM(LARGE((H95,J95,L95,N95,P95,R95),{1,2,3,4}))","v":107.98078888207642},"03:00:06",107.98078888207642,"",0,"",0,"",0,"",0,"",0,"",0,1,107.98078888207642]
[94,"Paul Marratt",{"$f":"IFERROR(VLOOKUP(B96,INDIRECT(\"'\"&$I$1&\"'!\"&\"$C$2:$H$200\"),2,FALSE),\"\")","v":"Hereford Triathlon Club"},{"$f":"IFERROR(VLOOKUP(B96,INDIRECT(\"'\"&$I$1&\"'!\"&\"$C$2:$H$200\"),3,FALSE),\"\")","v":"M"},{"$f":"IFERROR(VLOOKUP(B96,INDIRECT(\"'\"&$I$1&\"'!\"&\"$C$2:$H$200\"),4,FALSE),\"\")","v":"MV50"},{"$f":"SUM(LARGE((H96,J96,L96,N96,P96,R96),{1,2,3,4}))","v":106.85347135463145},"",0,3.6243055555555554,106.85347135463145,"",0,"",0,"",0,"",0,"",0,1,106.85347135463145]
[95,"Niki Radnege",{"$f":"IFERROR(VLOOKUP(B97,INDIRECT(\"'\"&$K$1&\"'!\"&\"$C$2:$H$200\"),2,FALSE),\"\")","v":0},{"$f":"IFERROR(VLOOKUP(B97,INDIRECT(\"'\"&$K$1&\"'!\"&\"$C$2:$H$200\"),3,FALSE),\"\")","v":"M"},{"$f":"IFERROR(VLOOKUP(B97,INDIRECT(\"'\"&$K$1&\"'!\"&\"$C$2:$H$200\"),4,FALSE),\"\")","v":"M40"},{"$f":"SUM(LARGE((H97,J97,L97,N97,P97,R97),{1,2,3,4}))","v":106.67437156891073},"",0,"",0,"01:36:54",106.67437156891073,"",0,"",0,"",0,"",0,1,106.67437156891073]
[96,"Tim Hargreaves",{"$f":"IFERROR(VLOOKUP(B98,INDIRECT(\"'\"&$G$1&\"'!\"&\"$C$2:$H$200\"),2,FALSE),\"\")","v":"Buckley Runners"},{"$f":"IFERROR(VLOOKUP(B98,INDIRECT(\"'\"&$G$1&\"'!\"&\"$C$2:$H$200\"),3,FALSE),\"\")","v":"M"},{"$f":"IFERROR(VLOOKUP(B98,INDIRECT(\"'\"&$G$1&\"'!\"&\"$C$2:$H$200\"),4,FALSE),\"\")","v":"V50"},{"$f":"SUM(LARGE((H98,J98,L98,N98,P98,R98),{1,2,3,4}))","v":106.45650248654539},"03:03:05",106.45650248654539,"",0,"",0,"",0,"",0,"",0,"",0,1,106.45650248654539]
[97,"Lou Awesomus Summers",{"$f":"IFERROR(VLOOKUP(B99,INDIRECT(\"'\"&$G$1&\"'!\"&\"$C$2:$H$200\"),2,FALSE),\"\")","v":"Mynydd Du"},{"$f":"IFERROR(VLOOKUP(B99,INDIRECT(\"'\"&$G$1&\"'!\"&\"$C$2:$H$200\"),3,FALSE),\"\")","v":"F"},{"$f":"IFERROR(VLOOKUP(B99,INDIRECT(\"'\"&$G$1&\"'!\"&\"$C$2:$H$200\"),4,FALSE),\"\")","v":"V50"},{"$f":"SUM(LARGE((H99,J99,L99,N99,P99,R99),{1,2,3,4}))","v":106.33728455616867},"03:03:19",106.33728455616867,"",0,"",0,"",0,"",0,"",0,"",0,1,106.33728455616867]
[98,"Donna Morris",{"$f":"IFERROR(VLOOKUP(B100,INDIRECT(\"'\"&$I$1&\"'!\"&\"$C$2:$H$200\"),2,FALSE),\"\")","v":"Breccon AC"},{"$f":"IFERROR(VLOOKUP(B100,INDIRECT(\"'\"&$I$1&\"'!\"&\"$C$2:$H$200\"),3,FALSE),\"\")","v":"F"},{"$f":"IFERROR(VLOOKUP(B100,INDIRECT(\"'\"&$I$1&\"'!\"&\"$C$2:$H$200\"),4,FALSE),\"\")","v":"SF"},{"$f":"SUM(LARGE((H100,J100,L100,N100,P100,R100),{1,2,3,4}))","v":106.19311083348207},"",0,3.65,106.19311083348207,"",0,"",0,"",0,"",0,"",0,1,106.19311083348207]
[99,"Sam Harness",{"$f":"IFERROR(VLOOKUP(B101,INDIRECT(\"'\"&$G$1&\"'!\"&\"$C$2:$H$200\"),2,FALSE),\"\")","v":"Monross Trailblazers"},{"$f":"IFERROR(VLOOKUP(B101,INDIRECT(\"'\"&$G$1&\"'!\"&\"$C$2:$H$200\"),3,FALSE),\"\")","v":"M"},{"$f":"IFERROR(VLOOKUP(B101,INDIRECT(\"'\"&$G$1&\"'!\"&\"$C$2:$H$200\"),4,FALSE),\"\")","v":"V40"},{"$f":"SUM(LARGE((H101,J101,L101,N101,P101,R101),{1,2,3,4}))","v":106.17548879351453},"03:03:38",106.17548879351453,"",0,"",0,"",0,"",0,"",0,"",0,1,106.17548879351453]
[100,"Mark Agnew",{"$f":"IFERROR(VLOOKUP(B102,INDIRECT(\"'\"&$K$1&\"'!\"&\"$C$2:$H$200\"),2,FALSE),\"\")","v":"Mercia"},{"$f":"IFERROR(VLOOKUP(B102,INDIRECT(\"'\"&$K$1&\"'!\"&\"$C$2:$H$200\"),3,FALSE),\"\")","v":"M"},{"$f":"IFERROR(VLOOKUP(B102,INDIRECT(\"'\"&$K$1&\"'!\"&\"$C$2:$H$200\"),4,FALSE),\"\")","v":"M50"},{"$f":"SUM(LARGE((H102,J102,L102,N102,P102,R102),{1,2,3,4}))","v":106.06440014125656},"",0,"",0,"01:37:32",106.06440014125656,"",0,"",0,"",0,"",0,1,106.06440014125656]
[101,"Nick Syrett",{"$f":"IFERROR(VLOOKUP(B103,INDIRECT(\"'\"&$I$1&\"'!\"&\"$C$2:$H$200\"),2,FALSE),\"\")","v":"Chorlton Runners"},{"$f":"IFERROR(VLOOKUP(B103,INDIRECT(\"'\"&$I$1&\"'!\"&\"$C$2:$H$200\"),3,FALSE),\"\")","v":"M"},{"$f":"IFERROR(VLOOKUP(B103,INDIRECT(\"'\"&$I$1&\"'!\"&\"$C$2:$H$200\"),4,FALSE),\"\")","v":"MV40"},{"$f":"SUM(LARGE((H103,J103,L103,N103,P103,R103),{1,2,3,4}))","v":105.99678743530252},"",0,3.6576388888888887,105.99678743530252,"",0,"",0,"",0,"",0,"",0,1,105.99678743530252]
[102,"Andy Horlick",{"$f":"IFERROR(VLOOKUP(B104,INDIRECT(\"'\"&$K$1&\"'!\"&\"$C$2:$H$200\"),2,FALSE),\"\")","v":"FOD"},{"$f":"IFERROR(VLOOKUP(B104,INDIRECT(\"'\"&$K$1&\"'!\"&\"$C$2:$H$200\"),3,FALSE),\"\")","v":"M"},{"$f":"IFERROR(VLOOKUP(B104,INDIRECT(\"'\"&$K$1&\"'!\"&\"$C$2:$H$200\"),4,FALSE),\"\")","v":"M40"},{"$f":"SUM(LARGE((H104,J104,L104,N104,P104,R104),{1,2,3,4}))","v":105.91993322418057},"",0,"",0,"01:37:41",105.91993322418057,"",0,"",0,"",0,"",0,1,105.91993322418057]
[103,"Gareth Bradbury",{"$f":"IFERROR(VLOOKUP(B105,INDIRECT(\"'\"&$I$1&\"'!\"&\"$C$2:$H$200\"),2,FALSE),\"\")","v":"MonrossTrailblazers"},{"$f":"IFERROR(VLOOKUP(B105,INDIRECT(\"'\"&$I$1&\"'!\"&\"$C$2:$H$200\"),3,FALSE),\"\")","v":"M"},{"$f":"IFERROR(VLOOKUP(B105,INDIRECT(\"'\"&$I$1&\"'!\"&\"$C$2:$H$200\"),4,FALSE),\"\")","v":"MV40"},{"$f":"SUM(LARGE((H105,J105,L105,N105,P105,R105),{1,2,3,4}))","v":105.7647688738176},"",0,3.6666666666666665,105.7647688738176,"",0,"",0,"",0,"",0,"",0,1,105.7647688738176]
[104,"Andy Vaudin",{"$f":"IFERROR(VLOOKUP(B106,INDIRECT(\"'\"&$K$1&\"'!\"&\"$C$2:$H$200\"),2,FALSE),\"\")","v":0},{"$f":"IFERROR(VLOOKUP(B106,INDIRECT(\"'\"&$K$1&\"'!\"&\"$C$2:$H$200\"),3,FALSE),\"\")","v":"M"},{"$f":"IFERROR(VLOOKUP(B106,INDIRECT(\"'\"&$K$1&\"'!\"&\"$C$2:$H$200\"),4,FALSE),\"\")","v":"M50"},{"$f":"SUM(LARGE((H106,J106,L106,N106,P106,R106),{1,2,3,4}))","v":105.6791550290539},"",0,"",0,"01:37:56",105.6791550290539,"",0,"",0,"",0,"",0,1,105.6791550290539]
[105,"Luke Wedmore",{"$f":"IFERROR(VLOOKUP(B107,INDIRECT(\"'\"&$I$1&\"'!\"&\"$C$2:$H$200\"),2,FALSE),\"\")","v":0},{"$f":"IFERROR(VLOOKUP(B107,INDIRECT(\"'\"&$I$1&\"'!\"&\"$C$2:$H$200\"),3,FALSE),\"\")","v":"M"},{"$f":"IFERROR(VLOOKUP(B107,INDIRECT(\"'\"&$I$1&\"'!\"&\"$C$2:$H$200\"),4,FALSE),\"\")","v":"SM"},{"$f":"SUM(LARGE((H107,J107,L107,N107,P107,R107),{1,2,3,4}))","v":105.49705514902729},"",0,3.6770833333333335,105.49705514902729,"",0,"",0,"",0,"",0,"",0,1,105.49705514902729]
[106,"Robin Bacon",{"$f":"IFERROR(VLOOKUP(B108,INDIRECT(\"'\"&$K$1&\"'!\"&\"$C$2:$H$200\"),2,FALSE),\"\")","v":"Mercia"},{"$f":"IFERROR(VLOOKUP(B108,INDIRECT(\"'\"&$K$1&\"'!\"&\"$C$2:$H$200\"),3,FALSE),\"\")","v":"M"},{"$f":"IFERROR(VLOOKUP(B108,INDIRECT(\"'\"&$K$1&\"'!\"&\"$C$2:$H$200\"),4,FALSE),\"\")","v":"M50"},{"$f":"SUM(LARGE((H108,J108,L108,N108,P108,R108),{1,2,3,4}))","v":105.37416931522681},"",0,"",0,"01:38:15",105.37416931522681,"",0,"",0,"",0,"",0,1,105.37416931522681]
[107,"Richard Haynes",{"$f":"IFERROR(VLOOKUP(B109,INDIRECT(\"'\"&$I$1&\"'!\"&\"$C$2:$H$200\"),2,FALSE),\"\")","v":"N/A"},{"$f":"IFERROR(VLOOKUP(B109,INDIRECT(\"'\"&$I$1&\"'!\"&\"$C$2:$H$200\"),3,FALSE),\"\")","v":"M"},{"$f":"IFERROR(VLOOKUP(B109,INDIRECT(\"'\"&$I$1&\"'!\"&\"$C$2:$H$200\"),4,FALSE),\"\")","v":"MV50"},{"$f":"SUM(LARGE((H109,J109,L109,N109,P109,R109),{1,2,3,4}))","v":105.24718900588969},"",0,3.6868055555555554,105.24718900588969,"",0,"",0,"",0,"",0,"",0,1,105.24718900588969]
[108,"Alexander Eynon",{"$f":"IFERROR(VLOOKUP(B110,INDIRECT(\"'\"&$K$1&\"'!\"&\"$C$2:$H$200\"),2,FALSE),\"\")","v":0},{"$f":"IFERROR(VLOOKUP(B110,INDIRECT(\"'\"&$K$1&\"'!\"&\"$C$2:$H$200\"),3,FALSE),\"\")","v":"M"},{"$f":"IFERROR(VLOOKUP(B110,INDIRECT(\"'\"&$K$1&\"'!\"&\"$C$2:$H$200\"),4,FALSE),\"\")","v":"M50"},{"$f":"SUM(LARGE((H110,J110,L110,N110,P110,R110),{1,2,3,4}))","v":105.03707984204951},"",0,"",0,"01:38:36",105.03707984204951,"",0,"",0,"",0,"",0,1,105.03707984204951]
[109,"Orlando Timmerman",{"$f":"IFERROR(VLOOKUP(B111,INDIRECT(\"'\"&$I$1&\"'!\"&\"$C$2:$H$200\"),2,FALSE),\"\")","v":0},{"$f":"IFERROR(VLOOKUP(B111,INDIRECT(\"'\"&$I$1&\"'!\"&\"$C$2:$H$200\"),3,FALSE),\"\")","v":"M"},{"$f":"IFERROR(VLOOKUP(B111,INDIRECT(\"'\"&$I$1&\"'!\"&\"$C$2:$H$200\"),4,FALSE),\"\")","v":"SM"},{"$f":"SUM(LARGE((H111,J111,L111,N111,P111,R111),{1,2,3,4}))","v":104.69391397465641},"",0,3.7083333333333335,104.69391397465641,"",0,"",0,"",0,"",0,"",0,1,104.69391397465641]
[110,"James Bellin",{"$f":"IFERROR(VLOOKUP(B112,INDIRECT(\"'\"&$K$1&\"'!\"&\"$C$2:$H$200\"),2,FALSE),\"\")","v":0},{"$f":"IFERROR(VLOOKUP(B112,INDIRECT(\"'\"&$K$1&\"'!\"&\"$C$2:$H$200\"),3,FALSE),\"\")","v":"M"},{"$f":"IFERROR(VLOOKUP(B112,INDIRECT(\"'\"&$K$1&\"'!\"&\"$C$2:$H$200\"),4,FALSE),\"\")","v":"M"},{"$f":"SUM(LARGE((H112,J112,L112,N112,P112,R112),{1,2,3,4}))","v":104.60367909082153},"",0,"",0,"01:39:03",104.60367909082153,"",0,"",0,"",0,"",0,1,104.60367909082153]
[111,"Andy Creber",{"$f":"IFERROR(VLOOKUP(B113,INDIRECT(\"'\"&$I$1&\"'!\"&\"$C$2:$H$200\"),2,FALSE),\"\")","v":"Mynydd Du"},{"$f":"IFERROR(VLOOKUP(B113,INDIRECT(\"'\"&$I$1&\"'!\"&\"$C$2:$H$200\"),3,FALSE),\"\")","v":"M"},{"$f":"IFERROR(VLOOKUP(B113,INDIRECT(\"'\"&$I$1&\"'!\"&\"$C$2:$H$200\"),4,FALSE),\"\")","v":"MV60"},{"$f":"SUM(LARGE((H113,J113,L113,N113,P113,R113),{1,2,3,4}))","v":104.44404783151882},"",0,3.7180555555555554,104.44404783151882,"",0,"",0,"",0,"",0,"",0,1,104.44404783151882]
[112,"Ross  Walker",{"$f":"IFERROR(VLOOKUP(B114,INDIRECT(\"'\"&$I$1&\"'!\"&\"$C$2:$H$200\"),2,FALSE),\"\")","v":"Chepstow Harriers"},{"$f":"IFERROR(VLOOKUP(B114,INDIRECT(\"'\"&$I$1&\"'!\"&\"$C$2:$H$200\"),3,FALSE),\"\")","v":"M"},{"$f":"IFERROR(VLOOKUP(B114,INDIRECT(\"'\"&$I$1&\"'!\"&\"$C$2:$H$200\"),4,FALSE),\"\")","v":"MV40"},{"$f":"SUM(LARGE((H114,J114,L114,N114,P114,R114),{1,2,3,4}))","v":103.48027842227377},"",0,3.755555555555556,103.48027842227377,"",0,"",0,"",0,"",0,"",0,1,103.48027842227377]
[113,"Andrew Brasington",{"$f":"IFERROR(VLOOKUP(B115,INDIRECT(\"'\"&$K$1&\"'!\"&\"$C$2:$H$200\"),2,FALSE),\"\")","v":"Ebbw Vale"},{"$f":"IFERROR(VLOOKUP(B115,INDIRECT(\"'\"&$K$1&\"'!\"&\"$C$2:$H$200\"),3,FALSE),\"\")","v":"M"},{"$f":"IFERROR(VLOOKUP(B115,INDIRECT(\"'\"&$K$1&\"'!\"&\"$C$2:$H$200\"),4,FALSE),\"\")","v":"M50"},{"$f":"SUM(LARGE((H115,J115,L115,N115,P115,R115),{1,2,3,4}))","v":103.43189187453849},"",0,"",0,"01:40:16",103.43189187453849,"",0,"",0,"",0,"",0,1,103.43189187453849]
[114,"Glyn Fletcher",{"$f":"IFERROR(VLOOKUP(B116,INDIRECT(\"'\"&$G$1&\"'!\"&\"$C$2:$H$200\"),2,FALSE),\"\")","v":"Maldwyn Harriers"},{"$f":"IFERROR(VLOOKUP(B116,INDIRECT(\"'\"&$G$1&\"'!\"&\"$C$2:$H$200\"),3,FALSE),\"\")","v":"M"},{"$f":"IFERROR(VLOOKUP(B116,INDIRECT(\"'\"&$G$1&\"'!\"&\"$C$2:$H$200\"),4,FALSE),\"\")","v":"V50"},{"$f":"SUM(LARGE((H116,J116,L116,N116,P116,R116),{1,2,3,4}))","v":103.35683629675046},"03:09:09",103.35683629675046,"",0,"",0,"",0,"",0,"",0,"",0,1,103.35683629675046]
[115,"Andrew Pritchard",{"$f":"IFERROR(VLOOKUP(B117,INDIRECT(\"'\"&$K$1&\"'!\"&\"$C$2:$H$200\"),2,FALSE),\"\")","v":"Buckley Runners"},{"$f":"IFERROR(VLOOKUP(B117,INDIRECT(\"'\"&$K$1&\"'!\"&\"$C$2:$H$200\"),3,FALSE),\"\")","v":"M"},{"$f":"IFERROR(VLOOKUP(B117,INDIRECT(\"'\"&$K$1&\"'!\"&\"$C$2:$H$200\"),4,FALSE),\"\")","v":"M40"},{"$f":"SUM(LARGE((H117,J117,L117,N117,P117,R117),{1,2,3,4}))","v":103.17506179973674},"",0,"",0,"01:40:32",103.17506179973674,"",0,"",0,"",0,"",0,1,103.17506179973674]
[116,"Sanjai Sharma",{"$f":"IFERROR(VLOOKUP(B118,INDIRECT(\"'\"&$K$1&\"'!\"&\"$C$2:$H$200\"),2,FALSE),\"\")","v":"Bounemouth"},{"$f":"IFERROR(VLOOKUP(B118,INDIRECT(\"'\"&$K$1&\"'!\"&\"$C$2:$H$200\"),3,FALSE),\"\")","v":"M"},{"$f":"IFERROR(VLOOKUP(B118,INDIRECT(\"'\"&$K$1&\"'!\"&\"$C$2:$H$200\"),4,FALSE),\"\")","v":"M50"},{"$f":"SUM(LARGE((H118,J118,L118,N118,P118,R118),{1,2,3,4}))","v":103.07875052168608},"",0,"",0,"01:40:38",103.07875052168608,"",0,"",0,"",0,"",0,1,103.07875052168608]
[117,"Sam Charrington",{"$f":"IFERROR(VLOOKUP(B119,INDIRECT(\"'\"&$G$1&\"'!\"&\"$C$2:$H$200\"),2,FALSE),\"\")","v":"Mynydd Du"},{"$f":"IFERROR(VLOOKUP(B119,INDIRECT(\"'\"&$G$1&\"'!\"&\"$C$2:$H$200\"),3,FALSE),\"\")","v":"M"},{"$f":"IFERROR(VLOOKUP(B119,INDIRECT(\"'\"&$G$1&\"'!\"&\"$C$2:$H$200\"),4,FALSE),\"\")","v":"V40"},{"$f":"SUM(LARGE((H119,J119,L119,N119,P119,R119),{1,2,3,4}))","v":103.04176033789767},"03:09:46",103.04176033789767,"",0,"",0,"",0,"",0,"",0,"",0,1,103.04176033789767]
[118,"Phil Richards",{"$f":"IFERROR(VLOOKUP(B120,INDIRECT(\"'\"&$K$1&\"'!\"&\"$C$2:$H$200\"),2,FALSE),\"\")","v":"Weston"},{"$f":"IFERROR(VLOOKUP(B120,INDIRECT(\"'\"&$K$1&\"'!\"&\"$C$2:$H$200\"),3,FALSE),\"\")","v":"F"},{"$f":"IFERROR(VLOOKUP(B120,INDIRECT(\"'\"&$K$1&\"'!\"&\"$C$2:$H$200\"),4,FALSE),\"\")","v":"F40"},{"$f":"SUM(LARGE((H120,J120,L120,N120,P120,R120),{1,2,3,4}))","v":102.83797232655942},"",0,"",0,"01:40:53",102.83797232655942,"",0,"",0,"",0,"",0,1,102.83797232655942]
[119,"alex banks",{"$f":"IFERROR(VLOOKUP(B121,INDIRECT(\"'\"&$I$1&\"'!\"&\"$C$2:$H$200\"),2,FALSE),\"\")","v":"Bristol and West AC (est. 1882)"},{"$f":"IFERROR(VLOOKUP(B121,INDIRECT(\"'\"&$I$1&\"'!\"&\"$C$2:$H$200\"),3,FALSE),\"\")","v":"M"},{"$f":"IFERROR(VLOOKUP(B121,INDIRECT(\"'\"&$I$1&\"'!\"&\"$C$2:$H$200\"),4,FALSE),\"\")","v":"SM"},{"$f":"SUM(LARGE((H121,J121,L121,N121,P121,R121),{1,2,3,4}))","v":102.5522041763341},"",0,3.7916666666666665,102.5522041763341,"",0,"",0,"",0,"",0,"",0,1,102.5522041763341]
[120,"Sue Howarth",{"$f":"IFERROR(VLOOKUP(B122,INDIRECT(\"'\"&$G$1&\"'!\"&\"$C$2:$H$200\"),2,FALSE),\"\")","v":"Mercia"},{"$f":"IFERROR(VLOOKUP(B122,INDIRECT(\"'\"&$G$1&\"'!\"&\"$C$2:$H$200\"),3,FALSE),\"\")","v":"F"},{"$f":"IFERROR(VLOOKUP(B122,INDIRECT(\"'\"&$G$1&\"'!\"&\"$C$2:$H$200\"),4,FALSE),\"\")","v":"V50"},{"$f":"SUM(LARGE((H122,J122,L122,N122,P122,R122),{1,2,3,4}))","v":102.46270181892498},"03:10:54",102.46270181892498,"",0,"",0,"",0,"",0,"",0,"",0,1,102.46270181892498]
[121,"David Mackie",{"$f":"IFERROR(VLOOKUP(B123,INDIRECT(\"'\"&$G$1&\"'!\"&\"$C$2:$H$200\"),2,FALSE),\"\")","v":"Corsham Running Club"},{"$f":"IFERROR(VLOOKUP(B123,INDIRECT(\"'\"&$G$1&\"'!\"&\"$C$2:$H$200\"),3,FALSE),\"\")","v":"M"},{"$f":"IFERROR(VLOOKUP(B123,INDIRECT(\"'\"&$G$1&\"'!\"&\"$C$2:$H$200\"),4,FALSE),\"\")","v":"V40"},{"$f":"SUM(LARGE((H123,J123,L123,N123,P123,R123),{1,2,3,4}))","v":102.37754615437018},"03:11:04",102.37754615437018,"",0,"",0,"",0,"",0,"",0,"",0,1,102.37754615437018]
[122,"Kevin Hagley",{"$f":"IFERROR(VLOOKUP(B124,INDIRECT(\"'\"&$K$1&\"'!\"&\"$C$2:$H$200\"),2,FALSE),\"\")","v":"SWRR"},{"$f":"IFERROR(VLOOKUP(B124,INDIRECT(\"'\"&$K$1&\"'!\"&\"$C$2:$H$200\"),3,FALSE),\"\")","v":"M"},{"$f":"IFERROR(VLOOKUP(B124,INDIRECT(\"'\"&$K$1&\"'!\"&\"$C$2:$H$200\"),4,FALSE),\"\")","v":"M50"},{"$f":"SUM(LARGE((H124,J124,L124,N124,P124,R124),{1,2,3,4}))","v":102.19589713955503},"",0,"",0,"01:41:33",102.19589713955503,"",0,"",0,"",0,"",0,1,102.19589713955503]
[123,"David Wood",{"$f":"IFERROR(VLOOKUP(B125,INDIRECT(\"'\"&$I$1&\"'!\"&\"$C$2:$H$200\"),2,FALSE),\"\")","v":"Dursley Running Club"},{"$f":"IFERROR(VLOOKUP(B125,INDIRECT(\"'\"&$I$1&\"'!\"&\"$C$2:$H$200\"),3,FALSE),\"\")","v":"M"},{"$f":"IFERROR(VLOOKUP(B125,INDIRECT(\"'\"&$I$1&\"'!\"&\"$C$2:$H$200\"),4,FALSE),\"\")","v":"MV50"},{"$f":"SUM(LARGE((H125,J125,L125,N125,P125,R125),{1,2,3,4}))","v":101.7847581652686},"",0,3.8215277777777779,101.7847581652686,"",0,"",0,"",0,"",0,"",0,1,101.7847581652686]
[124,"Peter Sowerby",{"$f":"IFERROR(VLOOKUP(B126,INDIRECT(\"'\"&$K$1&\"'!\"&\"$C$2:$H$200\"),2,FALSE),\"\")","v":"Brecon"},{"$f":"IFERROR(VLOOKUP(B126,INDIRECT(\"'\"&$K$1&\"'!\"&\"$C$2:$H$200\"),3,FALSE),\"\")","v":"M"},{"$f":"IFERROR(VLOOKUP(B126,INDIRECT(\"'\"&$K$1&\"'!\"&\"$C$2:$H$200\"),4,FALSE),\"\")","v":"M50"},{"$f":"SUM(LARGE((H126,J126,L126,N126,P126,R126),{1,2,3,4}))","v":101.71434074930174},"",0,"",0,"01:42:03",101.71434074930174,"",0,"",0,"",0,"",0,1,101.71434074930174]
[125,"Tony Wooldridge",{"$f":"IFERROR(VLOOKUP(B127,INDIRECT(\"'\"&$I$1&\"'!\"&\"$C$2:$H$200\"),2,FALSE),\"\")","v":"Dursley Running Club"},{"$f":"IFERROR(VLOOKUP(B127,INDIRECT(\"'\"&$I$1&\"'!\"&\"$C$2:$H$200\"),3,FALSE),\"\")","v":"M"},{"$f":"IFERROR(VLOOKUP(B127,INDIRECT(\"'\"&$I$1&\"'!\"&\"$C$2:$H$200\"),4,FALSE),\"\")","v":"MV65"},{"$f":"SUM(LARGE((H127,J127,L127,N127,P127,R127),{1,2,3,4}))","v":101.26717829734071},"",0,3.8416666666666668,101.26717829734071,"",0,"",0,"",0,"",0,"",0,1,101.26717829734071]
[126,"Graeme Hughes",{"$f":"IFERROR(VLOOKUP(B128,INDIRECT(\"'\"&$G$1&\"'!\"&\"$C$2:$H$200\"),2,FALSE),\"\")","v":"N/A"},{"$f":"IFERROR(VLOOKUP(B128,INDIRECT(\"'\"&$G$1&\"'!\"&\"$C$2:$H$200\"),3,FALSE),\"\")","v":"M"},{"$f":"IFERROR(VLOOKUP(B128,INDIRECT(\"'\"&$G$1&\"'!\"&\"$C$2:$H$200\"),4,FALSE),\"\")","v":"V40"},{"$f":"SUM(LARGE((H128,J128,L128,N128,P128,R128),{1,2,3,4}))","v":100.53818379998636},"03:14:40",100.53818379998636,"",0,"",0,"",0,"",0,"",0,"",0,1,100.53818379998636]
[127,"Laura Lelievre",{"$f":"IFERROR(VLOOKUP(B129,INDIRECT(\"'\"&$G$1&\"'!\"&\"$C$2:$H$200\"),2,FALSE),\"\")","v":"Monross Trailblazers"},{"$f":"IFERROR(VLOOKUP(B129,INDIRECT(\"'\"&$G$1&\"'!\"&\"$C$2:$H$200\"),3,FALSE),\"\")","v":"F"},{"$f":"IFERROR(VLOOKUP(B129,INDIRECT(\"'\"&$G$1&\"'!\"&\"$C$2:$H$200\"),4,FALSE),\"\")","v":"Open"},{"$f":"SUM(LARGE((H129,J129,L129,N129,P129,R129),{1,2,3,4}))","v":100.51263710061993},"03:14:43",100.51263710061993,"",0,"",0,"",0,"",0,"",0,"",0,1,100.51263710061993]
[128,"Kenneth Cox",{"$f":"IFERROR(VLOOKUP(B130,INDIRECT(\"'\"&$K$1&\"'!\"&\"$C$2:$H$200\"),2,FALSE),\"\")","v":"Southville"},{"$f":"IFERROR(VLOOKUP(B130,INDIRECT(\"'\"&$K$1&\"'!\"&\"$C$2:$H$200\"),3,FALSE),\"\")","v":"M"},{"$f":"IFERROR(VLOOKUP(B130,INDIRECT(\"'\"&$K$1&\"'!\"&\"$C$2:$H$200\"),4,FALSE),\"\")","v":"M"},{"$f":"SUM(LARGE((H130,J130,L130,N130,P130,R130),{1,2,3,4}))","v":100.38203473626761},"",0,"",0,"01:43:26",100.38203473626761,"",0,"",0,"",0,"",0,1,100.38203473626761]
[129,"Nick Biggs",{"$f":"IFERROR(VLOOKUP(B131,INDIRECT(\"'\"&$K$1&\"'!\"&\"$C$2:$H$200\"),2,FALSE),\"\")","v":0},{"$f":"IFERROR(VLOOKUP(B131,INDIRECT(\"'\"&$K$1&\"'!\"&\"$C$2:$H$200\"),3,FALSE),\"\")","v":"M"},{"$f":"IFERROR(VLOOKUP(B131,INDIRECT(\"'\"&$K$1&\"'!\"&\"$C$2:$H$200\"),4,FALSE),\"\")","v":"M40"},{"$f":"SUM(LARGE((H131,J131,L131,N131,P131,R131),{1,2,3,4}))","v":100.09310090211562},{"$f":"IFERROR(VLOOKUP(B131,INDIRECT(\"'\"&$G$1&\"'!\"&\"$C$2:$H$200\"),5,FALSE),\"\")","v":""},{"$f":"IFERROR(VLOOKUP(B131,INDIRECT(\"'\"&$G$1&\"'!\"&\"$C$2:$H$200\"),6,FALSE),0)","v":0},{"$f":"IFERROR(VLOOKUP(B131,INDIRECT(\"'\"&$I$1&\"'!\"&\"$C$2:$G$200\"),5,FALSE),\"\")","v":""},{"$f":"IFERROR(VLOOKUP(B131,INDIRECT(\"'\"&$I$1&\"'!\"&\"$C$2:$H$200\"),6,FALSE),0)","v":0},{"$f":"IFERROR(VLOOKUP(B131,INDIRECT(\"'\"&$K$1&\"'!\"&\"$C$2:$H$200\"),5,FALSE),\"\")","v":"01:43:44"},{"$f":"IFERROR(VLOOKUP(B131,INDIRECT(\"'\"&$K$1&\"'!\"&\"$C$2:$H$200\"),6,FALSE),0)","v":100.09310090211562},{"$f":"IFERROR(VLOOKUP(B131,INDIRECT(\"'\"&$M$1&\"'!\"&\"$C$2:$h$200\"),5,FALSE),\"\")","v":""},{"$f":"IFERROR(VLOOKUP(B131,INDIRECT(\"'\"&$M$1&\"'!\"&\"$C$2:$h$200\"),6,FALSE),0)","v":0},{"$f":"IFERROR(VLOOKUP(B131,INDIRECT(\"'\"&$O$1&\"'!\"&\"$C$2:$h$200\"),5,FALSE),\"\")","v":""},{"$f":"IFERROR(VLOOKUP(B131,INDIRECT(\"'\"&$O$1&\"'!\"&\"$C$2:$h$200\"),6,FALSE),0)","v":0},{"$f":"IFERROR(VLOOKUP(B131,INDIRECT(\"'\"&$Q$1&\"'!\"&\"$C$2:$h$200\"),5,FALSE),\"\")","v":""},{"$f":"IFERROR(VLOOKUP(B131,INDIRECT(\"'\"&$Q$1&\"'!\"&\"$C$2:$h$200\"),6,FALSE),0)","v":0},{"$f":"IFERROR(VLOOKUP(D131,INDIRECT(\"'\"&$Q$1&\"'!\"&\"$C$2:$h$200\"),5,FALSE),\"\")","v":""},{"$f":"IFERROR(VLOOKUP(D131,INDIRECT(\"'\"&$S$1&\"'!\"&\"$C$2:$h$200\"),6,FALSE),0)","v":0},{"$f":"7-COUNTIF(G131:T131,\"\")","v":1},{"$f":"F131/IF(U131>4,4,U131)","v":100.09310090211562}]
[{"$f":"ROW(A130)","v":130},"Rhys Pippard",{"$f":"IFERROR(VLOOKUP(B132,INDIRECT(\"'\"&$G$1&\"'!\"&\"$C$2:$H$200\"),2,FALSE),\"\")","v":"Mynydd Du"},{"$f":"IFERROR(VLOOKUP(B132,INDIRECT(\"'\"&$G$1&\"'!\"&\"$C$2:$H$200\"),3,FALSE),\"\")","v":"M"},{"$f":"IFERROR(VLOOKUP(B132,INDIRECT(\"'\"&$G$1&\"'!\"&\"$C$2:$H$200\"),4,FALSE),\"\")","v":"Open"},{"$f":"SUM(LARGE((H132,J132,L132,N132,P132,R132),{1,2,3,4}))","v":99.490769125962245},"03:16:43",99.490769125962245,"",0,"",0,"",0,"",0,"",0,"",0,1,99.490769125962245]
[131,"Gareth Bryer",{"$f":"IFERROR(VLOOKUP(B133,INDIRECT(\"'\"&$K$1&\"'!\"&\"$C$2:$H$200\"),2,FALSE),\"\")","v":"Mynydd Du"},{"$f":"IFERROR(VLOOKUP(B133,INDIRECT(\"'\"&$K$1&\"'!\"&\"$C$2:$H$200\"),3,FALSE),\"\")","v":"M"},{"$f":"IFERROR(VLOOKUP(B133,INDIRECT(\"'\"&$K$1&\"'!\"&\"$C$2:$H$200\"),4,FALSE),\"\")","v":"M40"},{"$f":"SUM(LARGE((H133,J133,L133,N133,P133,R133),{1,2,3,4}))","v":99.129988121609045},"",0,"",0,"01:44:44",99.129988121609045,"",0,"",0,"",0,"",0,1,99.129988121609045]
[132,"Andrew Blackmore",{"$f":"IFERROR(VLOOKUP(B134,INDIRECT(\"'\"&$I$1&\"'!\"&\"$C$2:$H$200\"),2,FALSE),\"\")","v":"Mynyddwyr de Cymru"},{"$f":"IFERROR(VLOOKUP(B134,INDIRECT(\"'\"&$I$1&\"'!\"&\"$C$2:$H$200\"),3,FALSE),\"\")","v":"M"},{"$f":"IFERROR(VLOOKUP(B134,INDIRECT(\"'\"&$I$1&\"'!\"&\"$C$2:$H$200\"),4,FALSE),\"\")","v":"MV50"},{"$f":"SUM(LARGE((H134,J134,L134,N134,P134,R134),{1,2,3,4}))","v":98.804212029270033},"",0,3.9375,98.804212029270033,"",0,"",0,"",0,"",0,"",0,1,98.804212029270033]
[133,"James Gale",{"$f":"IFERROR(VLOOKUP(B135,INDIRECT(\"'\"&$K$1&\"'!\"&\"$C$2:$H$200\"),2,FALSE),\"\")","v":"Southville"},{"$f":"IFERROR(VLOOKUP(B135,INDIRECT(\"'\"&$K$1&\"'!\"&\"$C$2:$H$200\"),3,FALSE),\"\")","v":"M"},{"$f":"IFERROR(VLOOKUP(B135,INDIRECT(\"'\"&$K$1&\"'!\"&\"$C$2:$H$200\"),4,FALSE),\"\")","v":"M"},{"$f":"SUM(LARGE((H135,J135,L135,N135,P135,R135),{1,2,3,4}))","v":98.744743009406392},"",0,"",0,"01:45:08",98.744743009406392,"",0,"",0,"",0,"",0,1,98.744743009406392]
[134,"Jerome Mearcister",{"$f":"IFERROR(VLOOKUP(B136,INDIRECT(\"'\"&$G$1&\"'!\"&\"$C$2:$H$200\"),2,FALSE),\"\")","v":"FRA"},{"$f":"IFERROR(VLOOKUP(B136,INDIRECT(\"'\"&$G$1&\"'!\"&\"$C$2:$H$200\"),3,FALSE),\"\")","v":"M"},{"$f":"IFERROR(VLOOKUP(B136,INDIRECT(\"'\"&$G$1&\"'!\"&\"$C$2:$H$200\"),4,FALSE),\"\")","v":"V40"},{"$f":"SUM(LARGE((H136,J136,L136,N136,P136,R136),{1,2,3,4}))","v":98.707337012058034},"03:18:15",98.707337012058034,"",0,"",0,"",0,"",0,"",0,"",0,1,98.707337012058034]
[135,"Sasha Habgood",{"$f":"IFERROR(VLOOKUP(B137,INDIRECT(\"'\"&$K$1&\"'!\"&\"$C$2:$H$200\"),2,FALSE),\"\")","v":"Mynydd Du"},{"$f":"IFERROR(VLOOKUP(B137,INDIRECT(\"'\"&$K$1&\"'!\"&\"$C$2:$H$200\"),3,FALSE),\"\")","v":"F"},{"$f":"IFERROR(VLOOKUP(B137,INDIRECT(\"'\"&$K$1&\"'!\"&\"$C$2:$H$200\"),4,FALSE),\"\")","v":"F40"},{"$f":"SUM(LARGE((H137,J137,L137,N137,P137,R137),{1,2,3,4}))","v":98.086615942726894},"",0,"",0,"01:45:49",98.086615942726894,"",0,"",0,"",0,"",0,1,98.086615942726894]
[136,"Vanessa  Lawson",{"$f":"IFERROR(VLOOKUP(B138,INDIRECT(\"'\"&$I$1&\"'!\"&\"$C$2:$H$200\"),2,FALSE),\"\")","v":"Chepstow Harriers"},{"$f":"IFERROR(VLOOKUP(B138,INDIRECT(\"'\"&$I$1&\"'!\"&\"$C$2:$H$200\"),3,FALSE),\"\")","v":"F"},{"$f":"IFERROR(VLOOKUP(B138,INDIRECT(\"'\"&$I$1&\"'!\"&\"$C$2:$H$200\"),4,FALSE),\"\")","v":"FV40"},{"$f":"SUM(LARGE((H138,J138,L138,N138,P138,R138),{1,2,3,4}))","v":97.947528109941089},"",0,3.9708333333333332,97.947528109941089,"",0,"",0,"",0,"",0,"",0,1,97.947528109941089]
[137,"Tom Morfey",{"$f":"IFERROR(VLOOKUP(B139,INDIRECT(\"'\"&$K$1&\"'!\"&\"$C$2:$H$200\"),2,FALSE),\"\")","v":"Cardiff Harlequins"},{"$f":"IFERROR(VLOOKUP(B139,INDIRECT(\"'\"&$K$1&\"'!\"&\"$C$2:$H$200\"),3,FALSE),\"\")","v":"M"},{"$f":"IFERROR(VLOOKUP(B139,INDIRECT(\"'\"&$K$1&\"'!\"&\"$C$2:$H$200\"),4,FALSE),\"\")","v":"U23"},{"$f":"SUM(LARGE((H139,J139,L139,N139,P139,R139),{1,2,3,4}))","v":97.845837747600257},"",0,"",0,"01:46:04",97.845837747600257,"",0,"",0,"",0,"",0,1,97.845837747600257]
[138,"Emily Cox",{"$f":"IFERROR(VLOOKUP(B140,INDIRECT(\"'\"&$K$1&\"'!\"&\"$C$2:$H$200\"),2,FALSE),\"\")","v":"Southville"},{"$f":"IFERROR(VLOOKUP(B140,INDIRECT(\"'\"&$K$1&\"'!\"&\"$C$2:$H$200\"),3,FALSE),\"\")","v":"F"},{"$f":"IFERROR(VLOOKUP(B140,INDIRECT(\"'\"&$K$1&\"'!\"&\"$C$2:$H$200\"),4,FALSE),\"\")","v":"F"},{"$f":"SUM(LARGE((H140,J140,L140,N140,P140,R140),{1,2,3,4}))","v":97.653215191498916},"",0,"",0,"01:46:16",97.653215191498916,"",0,"",0,"",0,"",0,1,97.653215191498916]
[139,"Dan Gregory",{"$f":"IFERROR(VLOOKUP(B141,INDIRECT(\"'\"&$G$1&\"'!\"&\"$C$2:$H$200\"),2,FALSE),\"\")","v":"N/A"},{"$f":"IFERROR(VLOOKUP(B141,INDIRECT(\"'\"&$G$1&\"'!\"&\"$C$2:$H$200\"),3,FALSE),\"\")","v":"M"},{"$f":"IFERROR(VLOOKUP(B141,INDIRECT(\"'\"&$G$1&\"'!\"&\"$C$2:$H$200\"),4,FALSE),\"\")","v":"V40"},{"$f":"SUM(LARGE((H141,J141,L141,N141,P141,R141),{1,2,3,4}))","v":97.64289120512295},"03:20:20",97.64289120512295,"",0,"",0,"",0,"",0,"",0,"",0,1,97.64289120512295]
[140,"Tom Dudding","N/A","M","Open",{"$f":"SUM(LARGE((H142,J142,L142,N142,P142,R142),{1,2,3,4}))","v":97.574766673479132},"03:20:28",97.574766673479132,"",0,"",0,"",0,"",0,"",0,"",0,1,97.574766673479132]
[141,"Tom Walker","N/A","M","Open",{"$f":"SUM(LARGE((H143,J143,L143,N143,P143,R143),{1,2,3,4}))","v":97.549219974112674},"03:20:31",97.549219974112674,"",0,"",0,"",0,"",0,"",0,"",0,1,97.549219974112674]
[142,"James Fletcher","Monross Trailblazers","M","V50",{"$f":"SUM(LARGE((H144,J144,L144,N144,P144,R144),{1,2,3,4}))","v":97.472579876013342},"03:20:40",97.472579876013342,"",0,"",0,"",0,"",0,"",0,"",0,1,97.472579876013342]
[143,"Andrew Clemant","TROT","M","V50",{"$f":"SUM(LARGE((H145,J145,L145,N145,P145,R145),{1,2,3,4}))","v":97.183050616526984},"03:21:14",97.183050616526984,"",0,"",0,"",0,"",0,"",0,"",0,1,97.183050616526984]
[144,"Stephen Priesonall","Running Somewhere Else","M","V50",{"$f":"SUM(LARGE((H146,J146,L146,N146,P146,R146),{1,2,3,4}))","v":96.459227467811175},"03:22:39",96.459227467811175,"",0,"",0,"",0,"",0,"",0,"",0,1,96.459227467811175]
[145,"Duncan Loughrey",{"$f":"IFERROR(VLOOKUP(B147,INDIRECT(\"'\"&$I$1&\"'!\"&\"$C$2:$H$200\"),2,FALSE),\"\")","v":0},{"$f":"IFERROR(VLOOKUP(B147,INDIRECT(\"'\"&$I$1&\"'!\"&\"$C$2:$H$200\"),3,FALSE),\"\")","v":"M"},{"$f":"IFERROR(VLOOKUP(B147,INDIRECT(\"'\"&$I$1&\"'!\"&\"$C$2:$H$200\"),4,FALSE),\"\")","v":"MV50"},{"$f":"SUM(LARGE((H147,J147,L147,N147,P147,R147),{1,2,3,4}))","v":96.234160271283216},"",0,4.0375000000000005,96.234160271283216,"",0,"",0,"",0,"",0,"",0,1,96.234160271283216]
[146,"James Woodier",{"$f":"IFERROR(VLOOKUP(B148,INDIRECT(\"'\"&$K$1&\"'!\"&\"$C$2:$H$200\"),2,FALSE),\"\")","v":"Mynydd Du"},{"$f":"IFERROR(VLOOKUP(B148,INDIRECT(\"'\"&$K$1&\"'!\"&\"$C$2:$H$200\"),3,FALSE),\"\")","v":"M"},{"$f":"IFERROR(VLOOKUP(B148,INDIRECT(\"'\"&$K$1&\"'!\"&\"$C$2:$H$200\"),4,FALSE),\"\")","v":"M"},{"$f":"SUM(LARGE((H148,J148,L148,N148,P148,R148),{1,2,3,4}))","v":96.224597900414139},"",0,"",0,"01:47:45",96.224597900414139,"",0,"",0,"",0,"",0,1,96.224597900414139]
[147,"Martin Carter",{"$f":"IFERROR(VLOOKUP(B149,INDIRECT(\"'\"&$G$1&\"'!\"&\"$C$2:$H$200\"),2,FALSE),\"\")","v":"Hay Hotfooters"},{"$f":"IFERROR(VLOOKUP(B149,INDIRECT(\"'\"&$G$1&\"'!\"&\"$C$2:$H$200\"),3,FALSE),\"\")","v":"M"},{"$f":"IFERROR(VLOOKUP(B149,INDIRECT(\"'\"&$G$1&\"'!\"&\"$C$2:$H$200\"),4,FALSE),\"\")","v":"V50"},{"$f":"SUM(LARGE((H149,J149,L149,N149,P149,R149),{1,2,3,4}))","v":96.016418012126167},"03:23:31",96.016418012126167,"",0,"",0,"",0,"",0,"",0,"",0,1,96.016418012126167]
[148,"Natahniel Swain",{"$f":"IFERROR(VLOOKUP(B150,INDIRECT(\"'\"&$G$1&\"'!\"&\"$C$2:$H$200\"),2,FALSE),\"\")","v":"MDC"},{"$f":"IFERROR(VLOOKUP(B150,INDIRECT(\"'\"&$G$1&\"'!\"&\"$C$2:$H$200\"),3,FALSE),\"\")","v":"M"},{"$f":"IFERROR(VLOOKUP(B150,INDIRECT(\"'\"&$G$1&\"'!\"&\"$C$2:$H$200\"),4,FALSE),\"\")","v":"Open"},{"$f":"SUM(LARGE((H150,J150,L150,N150,P150,R150),{1,2,3,4}))","v":95.990871312759722},"03:23:34",95.990871312759722,"",0,"",0,"",0,"",0,"",0,"",0,1,95.990871312759722]
[149,"Jono Simpson",{"$f":"IFERROR(VLOOKUP(B151,INDIRECT(\"'\"&$G$1&\"'!\"&\"$C$2:$H$200\"),2,FALSE),\"\")","v":"N/A"},{"$f":"IFERROR(VLOOKUP(B151,INDIRECT(\"'\"&$G$1&\"'!\"&\"$C$2:$H$200\"),3,FALSE),\"\")","v":"M"},{"$f":"IFERROR(VLOOKUP(B151,INDIRECT(\"'\"&$G$1&\"'!\"&\"$C$2:$H$200\"),4,FALSE),\"\")","v":"V50"},{"$f":"SUM(LARGE((H151,J151,L151,N151,P151,R151),{1,2,3,4}))","v":95.846106683016544},"03:23:51",95.846106683016544,"",0,"",0,"",0,"",0,"",0,"",0,1,95.846106683016544]
[150,"Martin Chammings",{"$f":"IFERROR(VLOOKUP(B152,INDIRECT(\"'\"&$I$1&\"'!\"&\"$C$2:$H$200\"),2,FALSE),\"\")","v":"Parc Bryn Bach"},{"$f":"IFERROR(VLOOKUP(B152,INDIRECT(\"'\"&$I$1&\"'!\"&\"$C$2:$H$200\"),3,FALSE),\"\")","v":"M"},{"$f":"IFERROR(VLOOKUP(B152,INDIRECT(\"'\"&$I$1&\"'!\"&\"$C$2:$H$200\"),4,FALSE),\"\")","v":"SM"},{"$f":"SUM(LARGE((H152,J152,L152,N152,P152,R152),{1,2,3,4}))","v":95.787970729966077},"",0,4.0548611111111112,95.787970729966077,"",0,"",0,"",0,"",0,"",0,1,95.787970729966077]
[151,"Darren Owen",{"$f":"IFERROR(VLOOKUP(B153,INDIRECT(\"'\"&$G$1&\"'!\"&\"$C$2:$H$200\"),2,FALSE),\"\")","v":"IND"},{"$f":"IFERROR(VLOOKUP(B153,INDIRECT(\"'\"&$G$1&\"'!\"&\"$C$2:$H$200\"),3,FALSE),\"\")","v":"M"},{"$f":"IFERROR(VLOOKUP(B153,INDIRECT(\"'\"&$G$1&\"'!\"&\"$C$2:$H$200\"),4,FALSE),\"\")","v":"V40"},{"$f":"SUM(LARGE((H153,J153,L153,N153,P153,R153),{1,2,3,4}))","v":95.343688262143218},"03:24:50",95.343688262143218,"",0,"",0,"",0,"",0,"",0,"",0,1,95.343688262143218]
[152,"Chris Munton","Forest of Dean AC","M","Open",{"$f":"SUM(LARGE((H154,J154,L154,N154,P154,R154),{1,2,3,4}))","v":94.917909939369153},"03:25:40",94.917909939369153,"",0,"",0,"",0,"",0,"",0,"",0,1,94.917909939369153]
[153,"Tim Adam Oliver","Monross Trailblazers","M","V40",{"$f":"SUM(LARGE((H155,J155,L155,N155,P155,R155),{1,2,3,4}))","v":94.900878806458209},"03:25:42",94.900878806458209,"",0,"",0,"",0,"",0,"",0,"",0,1,94.900878806458209]
[154,"Rhys Thomas","N/A","M","V40",{"$f":"SUM(LARGE((H156,J156,L156,N156,P156,R156),{1,2,3,4}))","v":94.883847673547223},"03:25:44",94.883847673547223,"",0,"",0,"",0,"",0,"",0,"",0,1,94.883847673547223]
[155,"Meinir Jones","Mynydd Du","F","V40",{"$f":"SUM(LARGE((H157,J157,L157,N157,P157,R157),{1,2,3,4}))","v":94.849785407725307},"03:25:48",94.849785407725307,"",0,"",0,"",0,"",0,"",0,"",0,1,94.849785407725307]
[156,"Kim Braznell","Mercia","F","V60",{"$f":"SUM(LARGE((H158,J158,L158,N158,P158,R158),{1,2,3,4}))","v":94.577287281149935},"03:26:20",94.577287281149935,"",0,"",0,"",0,"",0,"",0,"",0,1,94.577287281149935]
[157,"Rhys Ashbridge","N/A","M","Open",{"$f":"SUM(LARGE((H159,J159,L159,N159,P159,R159),{1,2,3,4}))","v":94.492131616595131},"03:26:30",94.492131616595131,"",0,"",0,"",0,"",0,"",0,"",0,1,94.492131616595131]
[158,"Hannah Hopkinson",{"$f":"IFERROR(VLOOKUP(B160,INDIRECT(\"'\"&$K$1&\"'!\"&\"$C$2:$H$200\"),2,FALSE),\"\")","v":0},{"$f":"IFERROR(VLOOKUP(B160,INDIRECT(\"'\"&$K$1&\"'!\"&\"$C$2:$H$200\"),3,FALSE),\"\")","v":"F"},{"$f":"IFERROR(VLOOKUP(B160,INDIRECT(\"'\"&$K$1&\"'!\"&\"$C$2:$H$200\"),4,FALSE),\"\")","v":"F"},{"$f":"SUM(LARGE((H160,J160,L160,N160,P160,R160),{1,2,3,4}))","v":93.800764069472535},"",0,"",0,"01:50:16",93.800764069472535,"",0,"",0,"",0,"",0,1,93.800764069472535]
[159,"Matthew Marshall",{"$f":"IFERROR(VLOOKUP(B161,INDIRECT(\"'\"&$K$1&\"'!\"&\"$C$2:$H$200\"),2,FALSE),\"\")","v":"Southville"},{"$f":"IFERROR(VLOOKUP(B161,INDIRECT(\"'\"&$K$1&\"'!\"&\"$C$2:$H$200\"),3,FALSE),\"\")","v":"M"},{"$f":"IFERROR(VLOOKUP(B161,INDIRECT(\"'\"&$K$1&\"'!\"&\"$C$2:$H$200\"),4,FALSE),\"\")","v":"M"},{"$f":"SUM(LARGE((H161,J161,L161,N161,P161,R161),{1,2,3,4}))","v":93.800764069472535},"",0,"",0,"01:50:16",93.800764069472535,"",0,"",0,"",0,"",0,1,93.800764069472535]
[160,"Dave Farrow",{"$f":"IFERROR(VLOOKUP(B162,INDIRECT(\"'\"&$I$1&\"'!\"&\"$C$2:$H$200\"),2,FALSE),\"\")","v":"Mercia Fell Runners"},{"$f":"IFERROR(VLOOKUP(B162,INDIRECT(\"'\"&$I$1&\"'!\"&\"$C$2:$H$200\"),3,FALSE),\"\")","v":"M"},{"$f":"IFERROR(VLOOKUP(B162,INDIRECT(\"'\"&$I$1&\"'!\"&\"$C$2:$H$200\"),4,FALSE),\"\")","v":"MV50"},{"$f":"SUM(LARGE((H162,J162,L162,N162,P162,R162),{1,2,3,4}))","v":93.681956094949143},"",0,4.1368055555555552,93.681956094949143,"",0,"",0,"",0,"",0,"",0,1,93.681956094949143]
[161,"Ben Watkins",{"$f":"IFERROR(VLOOKUP(B163,INDIRECT(\"'\"&$I$1&\"'!\"&\"$C$2:$H$200\"),2,FALSE),\"\")","v":"Mynydd Du"},{"$f":"IFERROR(VLOOKUP(B163,INDIRECT(\"'\"&$I$1&\"'!\"&\"$C$2:$H$200\"),3,FALSE),\"\")","v":"M"},{"$f":"IFERROR(VLOOKUP(B163,INDIRECT(\"'\"&$I$1&\"'!\"&\"$C$2:$H$200\"),4,FALSE),\"\")","v":"SM"},{"$f":"SUM(LARGE((H163,J163,L163,N163,P163,R163),{1,2,3,4}))","v":93.075138318757794},"",0,4.1604166666666664,93.075138318757794,"",0,"",0,"",0,"",0,"",0,1,93.075138318757794]
[162,"Richard Stanley",{"$f":"IFERROR(VLOOKUP(B164,INDIRECT(\"'\"&$G$1&\"'!\"&\"$C$2:$H$200\"),2,FALSE),\"\")","v":"Ampthill and Flitwick Flyers"},{"$f":"IFERROR(VLOOKUP(B164,INDIRECT(\"'\"&$G$1&\"'!\"&\"$C$2:$H$200\"),3,FALSE),\"\")","v":"M"},{"$f":"IFERROR(VLOOKUP(B164,INDIRECT(\"'\"&$G$1&\"'!\"&\"$C$2:$H$200\"),4,FALSE),\"\")","v":"V50"},{"$f":"SUM(LARGE((H164,J164,L164,N164,P164,R164),{1,2,3,4}))","v":92.99339192043054},"03:29:26",92.99339192043054,"",0,"",0,"",0,"",0,"",0,"",0,1,92.99339192043054]
[163,"James Griffiths",{"$f":"IFERROR(VLOOKUP(B165,INDIRECT(\"'\"&$I$1&\"'!\"&\"$C$2:$H$200\"),2,FALSE),\"\")","v":"Newent Runners"},{"$f":"IFERROR(VLOOKUP(B165,INDIRECT(\"'\"&$I$1&\"'!\"&\"$C$2:$H$200\"),3,FALSE),\"\")","v":"M"},{"$f":"IFERROR(VLOOKUP(B165,INDIRECT(\"'\"&$I$1&\"'!\"&\"$C$2:$H$200\"),4,FALSE),\"\")","v":"MV50"},{"$f":"SUM(LARGE((H165,J165,L165,N165,P165,R165),{1,2,3,4}))","v":92.87881492057825},"",0,4.1680555555555552,92.87881492057825,"",0,"",0,"",0,"",0,"",0,1,92.87881492057825]
[164,"Andy Blackmore",{"$f":"IFERROR(VLOOKUP(B166,INDIRECT(\"'\"&$K$1&\"'!\"&\"$C$2:$H$200\"),2,FALSE),\"\")","v":"MDC"},{"$f":"IFERROR(VLOOKUP(B166,INDIRECT(\"'\"&$K$1&\"'!\"&\"$C$2:$H$200\"),3,FALSE),\"\")","v":"M"},{"$f":"IFERROR(VLOOKUP(B166,INDIRECT(\"'\"&$K$1&\"'!\"&\"$C$2:$H$200\"),4,FALSE),\"\")","v":"M50"},{"$f":"SUM(LARGE((H166,J166,L166,N166,P166,R166),{1,2,3,4}))","v":92.532665575138864},"rtd",0,"",0,"01:51:35",92.532665575138864,"",0,"",0,"",0,"",0,2,46.266332787569432]
[165,"Eluned Malone",{"$f":"IFERROR(VLOOKUP(B167,INDIRECT(\"'\"&$G$1&\"'!\"&\"$C$2:$H$200\"),2,FALSE),\"\")","v":"N/A"},{"$f":"IFERROR(VLOOKUP(B167,INDIRECT(\"'\"&$G$1&\"'!\"&\"$C$2:$H$200\"),3,FALSE),\"\")","v":"F"},{"$f":"IFERROR(VLOOKUP(B167,INDIRECT(\"'\"&$G$1&\"'!\"&\"$C$2:$H$200\"),4,FALSE),\"\")","v":"Open"},{"$f":"SUM(LARGE((H167,J167,L167,N167,P167,R167),{1,2,3,4}))","v":92.031132910961233},"03:31:19",92.031132910961233,"",0,"",0,"",0,"",0,"",0,"",0,1,92.031132910961233]
[166,"Emma Collins",{"$f":"IFERROR(VLOOKUP(B168,INDIRECT(\"'\"&$G$1&\"'!\"&\"$C$2:$H$200\"),2,FALSE),\"\")","v":"Denbigh Harriers"},{"$f":"IFERROR(VLOOKUP(B168,INDIRECT(\"'\"&$G$1&\"'!\"&\"$C$2:$H$200\"),3,FALSE),\"\")","v":"F"},{"$f":"IFERROR(VLOOKUP(B168,INDIRECT(\"'\"&$G$1&\"'!\"&\"$C$2:$H$200\"),4,FALSE),\"\")","v":"V50"},{"$f":"SUM(LARGE((H168,J168,L168,N168,P168,R168),{1,2,3,4}))","v":91.886368281218054},"03:31:36",91.886368281218054,"",0,"",0,"",0,"",0,"",0,"",0,1,91.886368281218054]
[167,"Andy Pollintine",{"$f":"IFERROR(VLOOKUP(B169,INDIRECT(\"'\"&$G$1&\"'!\"&\"$C$2:$H$200\"),2,FALSE),\"\")","v":"IND"},{"$f":"IFERROR(VLOOKUP(B169,INDIRECT(\"'\"&$G$1&\"'!\"&\"$C$2:$H$200\"),3,FALSE),\"\")","v":"M"},{"$f":"IFERROR(VLOOKUP(B169,INDIRECT(\"'\"&$G$1&\"'!\"&\"$C$2:$H$200\"),4,FALSE),\"\")","v":"V50"},{"$f":"SUM(LARGE((H169,J169,L169,N169,P169,R169),{1,2,3,4}))","v":91.681994686286529},"03:32:00",91.681994686286529,"",0,"",0,"",0,"",0,"",0,"",0,1,91.681994686286529]
[168,"Celia  Mills",{"$f":"IFERROR(VLOOKUP(B170,INDIRECT(\"'\"&$I$1&\"'!\"&\"$C$2:$H$200\"),2,FALSE),\"\")","v":0},{"$f":"IFERROR(VLOOKUP(B170,INDIRECT(\"'\"&$I$1&\"'!\"&\"$C$2:$H$200\"),3,FALSE),\"\")","v":"F"},{"$f":"IFERROR(VLOOKUP(B170,INDIRECT(\"'\"&$I$1&\"'!\"&\"$C$2:$H$200\"),4,FALSE),\"\")","v":"MV60"},{"$f":"SUM(LARGE((H170,J170,L170,N170,P170,R170),{1,2,3,4}))","v":91.665179368195609},"",0,4.2152777777777777,91.665179368195609,"",0,"",0,"",0,"",0,"",0,1,91.665179368195609]
[169,"Hugh  Morgan Jones",{"$f":"IFERROR(VLOOKUP(B171,INDIRECT(\"'\"&$I$1&\"'!\"&\"$C$2:$H$200\"),2,FALSE),\"\")","v":"WFRA"},{"$f":"IFERROR(VLOOKUP(B171,INDIRECT(\"'\"&$I$1&\"'!\"&\"$C$2:$H$200\"),3,FALSE),\"\")","v":"M"},{"$f":"IFERROR(VLOOKUP(B171,INDIRECT(\"'\"&$I$1&\"'!\"&\"$C$2:$H$200\"),4,FALSE),\"\")","v":"MV50"},{"$f":"SUM(LARGE((H171,J171,L171,N171,P171,R171),{1,2,3,4}))","v":91.647331786542892},"",0,4.2159722222222227,91.647331786542892,"",0,"",0,"",0,"",0,"",0,1,91.647331786542892]
[170,"Tom Mollekin",{"$f":"IFERROR(VLOOKUP(B172,INDIRECT(\"'\"&$G$1&\"'!\"&\"$C$2:$H$200\"),2,FALSE),\"\")","v":"Mynydd Du"},{"$f":"IFERROR(VLOOKUP(B172,INDIRECT(\"'\"&$G$1&\"'!\"&\"$C$2:$H$200\"),3,FALSE),\"\")","v":"M"},{"$f":"IFERROR(VLOOKUP(B172,INDIRECT(\"'\"&$G$1&\"'!\"&\"$C$2:$H$200\"),4,FALSE),\"\")","v":"Open"},{"$f":"SUM(LARGE((H172,J172,L172,N172,P172,R172),{1,2,3,4}))","v":91.520198923632393},"03:32:19",91.520198923632393,"",0,"",0,"",0,"",0,"",0,"",0,1,91.520198923632393]
[171,"Emily Ford",{"$f":"IFERROR(VLOOKUP(B173,INDIRECT(\"'\"&$I$1&\"'!\"&\"$C$2:$H$200\"),2,FALSE),\"\")","v":"MDC"},{"$f":"IFERROR(VLOOKUP(B173,INDIRECT(\"'\"&$I$1&\"'!\"&\"$C$2:$H$200\"),3,FALSE),\"\")","v":"F"},{"$f":"IFERROR(VLOOKUP(B173,INDIRECT(\"'\"&$I$1&\"'!\"&\"$C$2:$H$200\"),4,FALSE),\"\")","v":"SF"},{"$f":"SUM(LARGE((H173,J173,L173,N173,P173,R173),{1,2,3,4}))","v":91.468855970016065},"",0,4.2229166666666664,91.468855970016065,"",0,"",0,"",0,"",0,"",0,1,91.468855970016065]
[172,"Daniel Wickham",{"$f":"IFERROR(VLOOKUP(B174,INDIRECT(\"'\"&$G$1&\"'!\"&\"$C$2:$H$200\"),2,FALSE),\"\")","v":"N/A"},{"$f":"IFERROR(VLOOKUP(B174,INDIRECT(\"'\"&$G$1&\"'!\"&\"$C$2:$H$200\"),3,FALSE),\"\")","v":"M"},{"$f":"IFERROR(VLOOKUP(B174,INDIRECT(\"'\"&$G$1&\"'!\"&\"$C$2:$H$200\"),4,FALSE),\"\")","v":"Open"},{"$f":"SUM(LARGE((H174,J174,L174,N174,P174,R174),{1,2,3,4}))","v":90.830438040738471},"03:33:40",90.830438040738471,"",0,"",0,"",0,"",0,"",0,"",0,1,90.830438040738471]
[173,"alan stanley",{"$f":"IFERROR(VLOOKUP(B175,INDIRECT(\"'\"&$I$1&\"'!\"&\"$C$2:$H$200\"),2,FALSE),\"\")","v":"n/a"},{"$f":"IFERROR(VLOOKUP(B175,INDIRECT(\"'\"&$I$1&\"'!\"&\"$C$2:$H$200\"),3,FALSE),\"\")","v":"M"},{"$f":"IFERROR(VLOOKUP(B175,INDIRECT(\"'\"&$I$1&\"'!\"&\"$C$2:$H$200\"),4,FALSE),\"\")","v":"MV50"},{"$f":"SUM(LARGE((H175,J175,L175,N175,P175,R175),{1,2,3,4}))","v":90.808495448866694},"",0,4.2486111111111109,90.808495448866694,"",0,"",0,"",0,"",0,"",0,1,90.808495448866694]
[174,"Jo Shelmerdine",{"$f":"IFERROR(VLOOKUP(B176,INDIRECT(\"'\"&$I$1&\"'!\"&\"$C$2:$H$200\"),2,FALSE),\"\")","v":"Andover AC"},{"$f":"IFERROR(VLOOKUP(B176,INDIRECT(\"'\"&$I$1&\"'!\"&\"$C$2:$H$200\"),3,FALSE),\"\")","v":"F"},{"$f":"IFERROR(VLOOKUP(B176,INDIRECT(\"'\"&$I$1&\"'!\"&\"$C$2:$H$200\"),4,FALSE),\"\")","v":"SF"},{"$f":"SUM(LARGE((H176,J176,L176,N176,P176,R176),{1,2,3,4}))","v":90.487238979118317},"",0,4.2611111111111111,90.487238979118317,"",0,"",0,"",0,"",0,"",0,1,90.487238979118317]
[175,"Naomi Law",{"$f":"IFERROR(VLOOKUP(B177,INDIRECT(\"'\"&$K$1&\"'!\"&\"$C$2:$H$200\"),2,FALSE),\"\")","v":"Mynydd Du"},{"$f":"IFERROR(VLOOKUP(B177,INDIRECT(\"'\"&$K$1&\"'!\"&\"$C$2:$H$200\"),3,FALSE),\"\")","v":"F"},{"$f":"IFERROR(VLOOKUP(B177,INDIRECT(\"'\"&$K$1&\"'!\"&\"$C$2:$H$200\"),4,FALSE),\"\")","v":"F40"},{"$f":"SUM(LARGE((H177,J177,L177,N177,P177,R177),{1,2,3,4}))","v":90.445921217374561},"",0,"",0,"01:53:45",90.445921217374561,"",0,"",0,"",0,"",0,1,90.445921217374561]
[176,"Sharon Woods",{"$f":"IFERROR(VLOOKUP(B178,INDIRECT(\"'\"&$G$1&\"'!\"&\"$C$2:$H$200\"),2,FALSE),\"\")","v":"Mynydd Du"},{"$f":"IFERROR(VLOOKUP(B178,INDIRECT(\"'\"&$G$1&\"'!\"&\"$C$2:$H$200\"),3,FALSE),\"\")","v":"F"},{"$f":"IFERROR(VLOOKUP(B178,INDIRECT(\"'\"&$G$1&\"'!\"&\"$C$2:$H$200\"),4,FALSE),\"\")","v":"V50"},{"$f":"SUM(LARGE((H178,J178,L178,N178,P178,R178),{1,2,3,4}))","v":90.276926221132214},"03:34:45",90.276926221132214,"",0,"",0,"",0,"",0,"",0,"",0,1,90.276926221132214]
[177,"Roger Mills","Fairwater Runners","M","V40",{"$f":"SUM(LARGE((H179,J179,L179,N179,P179,R179),{1,2,3,4}))","v":90.157708290755494},"03:34:59",90.157708290755494,"",0,"",0,"",0,"",0,"",0,"",0,1,90.157708290755494]
[178,"Jenny Yate","Mynydd Du","F","Open",{"$f":"SUM(LARGE((H180,J180,L180,N180,P180,R180),{1,2,3,4}))","v":90.132161591389064},"03:35:02",90.132161591389064,"",0,"",0,"",0,"",0,"",0,"",0,1,90.132161591389064]
[179,"Rhys White","N/A","M","V60",{"$f":"SUM(LARGE((H181,J181,L181,N181,P181,R181),{1,2,3,4}))","v":90.098099325567119},"03:35:06",90.098099325567119,"",0,"",0,"",0,"",0,"",0,"",0,1,90.098099325567119]
[180,"Callum Greenaway","N/A","M","Open",{"$f":"SUM(LARGE((H182,J182,L182,N182,P182,R182),{1,2,3,4}))","v":88.863342189522427},"03:37:31",88.863342189522427,"",0,"",0,"",0,"",0,"",0,"",0,1,88.863342189522427]
[181,"Victoria Howarth","N/A","F","Open",{"$f":"SUM(LARGE((H183,J183,L183,N183,P183,R183),{1,2,3,4}))","v":88.837795490155983},"03:37:34",88.837795490155983,"",0,"",0,"",0,"",0,"",0,"",0,1,88.837795490155983]
[182,"Jane Lewis","N/A","F","V50",{"$f":"SUM(LARGE((H184,J184,L184,N184,P184,R184),{1,2,3,4}))","v":88.795217657878595},"03:37:39",88.795217657878595,"",0,"",0,"",0,"",0,"",0,"",0,1,88.795217657878595]
[183,"Anthony Howells","MDC","M","V50",{"$f":"SUM(LARGE((H185,J185,L185,N185,P185,R185),{1,2,3,4}))","v":88.727093126234749},"03:37:47",88.727093126234749,"",0,"",0,"",0,"",0,"",0,"",0,1,88.727093126234749]
[184,"Michael Marks",{"$f":"IFERROR(VLOOKUP(B186,INDIRECT(\"'\"&$I$1&\"'!\"&\"$C$2:$H$200\"),2,FALSE),\"\")","v":"FODAC"},{"$f":"IFERROR(VLOOKUP(B186,INDIRECT(\"'\"&$I$1&\"'!\"&\"$C$2:$H$200\"),3,FALSE),\"\")","v":"M"},{"$f":"IFERROR(VLOOKUP(B186,INDIRECT(\"'\"&$I$1&\"'!\"&\"$C$2:$H$200\"),4,FALSE),\"\")","v":"MV50"},{"$f":"SUM(LARGE((H186,J186,L186,N186,P186,R186),{1,2,3,4}))","v":87.399607353203621},"",0,4.3812500000000005,87.399607353203621,"",0,"",0,"",0,"",0,"",0,1,87.399607353203621]
[185,"Mike Harris",{"$f":"IFERROR(VLOOKUP(B187,INDIRECT(\"'\"&$K$1&\"'!\"&\"$C$2:$H$200\"),2,FALSE),\"\")","v":"Westbury"},{"$f":"IFERROR(VLOOKUP(B187,INDIRECT(\"'\"&$K$1&\"'!\"&\"$C$2:$H$200\"),3,FALSE),\"\")","v":"M"},{"$f":"IFERROR(VLOOKUP(B187,INDIRECT(\"'\"&$K$1&\"'!\"&\"$C$2:$H$200\"),4,FALSE),\"\")","v":"M60"},{"$f":"SUM(LARGE((H187,J187,L187,N187,P187,R187),{1,2,3,4}))","v":86.978715207550806},"",0,"",0,"01:57:21",86.978715207550806,"",0,"",0,"",0,"",0,1,86.978715207550806]
[186,"Kate O'Sullivan",{"$f":"IFERROR(VLOOKUP(B188,INDIRECT(\"'\"&$K$1&\"'!\"&\"$C$2:$H$200\"),2,FALSE),\"\")","v":"Aberystwyth"},{"$f":"IFERROR(VLOOKUP(B188,INDIRECT(\"'\"&$K$1&\"'!\"&\"$C$2:$H$200\"),3,FALSE),\"\")","v":"F"},{"$f":"IFERROR(VLOOKUP(B188,INDIRECT(\"'\"&$K$1&\"'!\"&\"$C$2:$H$200\"),4,FALSE),\"\")","v":"F50"},{"$f":"SUM(LARGE((H188,J188,L188,N188,P188,R188),{1,2,3,4}))","v":86.224276862820631},"",0,"",0,"01:58:08",86.224276862820631,"",0,"",0,"",0,"",0,1,86.224276862820631]
[187,"Steve Harrhy",{"$f":"IFERROR(VLOOKUP(B189,INDIRECT(\"'\"&$K$1&\"'!\"&\"$C$2:$H$200\"),2,FALSE),\"\")","v":"Pont y Pwl"},{"$f":"IFERROR(VLOOKUP(B189,INDIRECT(\"'\"&$K$1&\"'!\"&\"$C$2:$H$200\"),3,FALSE),\"\")","v":"M"},{"$f":"IFERROR(VLOOKUP(B189,INDIRECT(\"'\"&$K$1&\"'!\"&\"$C$2:$H$200\"),4,FALSE),\"\")","v":"M50"},{"$f":"SUM(LARGE((H189,J189,L189,N189,P189,R189),{1,2,3,4}))","v":86.127965584769967},"",0,"",0,"01:58:14",86.127965584769967,"",0,"",0,"",0,"",0,1,86.127965584769967]
[188,"Ellie Salisbury",{"$f":"IFERROR(VLOOKUP(B190,INDIRECT(\"'\"&$G$1&\"'!\"&\"$C$2:$H$200\"),2,FALSE),\"\")","v":"Eryri Harriers"},{"$f":"IFERROR(VLOOKUP(B190,INDIRECT(\"'\"&$G$1&\"'!\"&\"$C$2:$H$200\"),3,FALSE),\"\")","v":"F"},{"$f":"IFERROR(VLOOKUP(B190,INDIRECT(\"'\"&$G$1&\"'!\"&\"$C$2:$H$200\"),4,FALSE),\"\")","v":"V50"},{"$f":"SUM(LARGE((H190,J190,L190,N190,P190,R190),{1,2,3,4}))","v":85.125008515566464},"03:44:50",85.125008515566464,"",0,"",0,"",0,"",0,"",0,"",0,1,85.125008515566464]
[189,"Bev Tucker",{"$f":"IFERROR(VLOOKUP(B191,INDIRECT(\"'\"&$K$1&\"'!\"&\"$C$2:$H$200\"),2,FALSE),\"\")","v":"Mynydd Du"},{"$f":"IFERROR(VLOOKUP(B191,INDIRECT(\"'\"&$K$1&\"'!\"&\"$C$2:$H$200\"),3,FALSE),\"\")","v":"F"},{"$f":"IFERROR(VLOOKUP(B191,INDIRECT(\"'\"&$K$1&\"'!\"&\"$C$2:$H$200\"),4,FALSE),\"\")","v":"F50"},{"$f":"SUM(LARGE((H191,J191,L191,N191,P191,R191),{1,2,3,4}))","v":83.912806189604794},"",0,"",0,"02:00:32",83.912806189604794,"",0,"",0,"",0,"",0,1,83.912806189604794]
[190,"Christine Farr",{"$f":"IFERROR(VLOOKUP(B192,INDIRECT(\"'\"&$K$1&\"'!\"&\"$C$2:$H$200\"),2,FALSE),\"\")","v":"MDC"},{"$f":"IFERROR(VLOOKUP(B192,INDIRECT(\"'\"&$K$1&\"'!\"&\"$C$2:$H$200\"),3,FALSE),\"\")","v":"F"},{"$f":"IFERROR(VLOOKUP(B192,INDIRECT(\"'\"&$K$1&\"'!\"&\"$C$2:$H$200\"),4,FALSE),\"\")","v":"F40"},{"$f":"SUM(LARGE((H192,J192,L192,N192,P192,R192),{1,2,3,4}))","v":83.832546791229248},"",0,"",0,"02:00:37",83.832546791229248,"",0,"",0,"",0,"",0,1,83.832546791229248]
[191,"Hugh Morgan-Jones",{"$f":"IFERROR(VLOOKUP(B193,INDIRECT(\"'\"&$K$1&\"'!\"&\"$C$2:$H$200\"),2,FALSE),\"\")","v":"WFRA"},{"$f":"IFERROR(VLOOKUP(B193,INDIRECT(\"'\"&$K$1&\"'!\"&\"$C$2:$H$200\"),3,FALSE),\"\")","v":"M"},{"$f":"IFERROR(VLOOKUP(B193,INDIRECT(\"'\"&$K$1&\"'!\"&\"$C$2:$H$200\"),4,FALSE),\"\")","v":"M50"},{"$f":"SUM(LARGE((H193,J193,L193,N193,P193,R193),{1,2,3,4}))","v":83.688079874153274},"",0,"",0,"02:00:46",83.688079874153274,"",0,"",0,"",0,"",0,1,83.688079874153274]
[192,"Vanessa Ball",{"$f":"IFERROR(VLOOKUP(B194,INDIRECT(\"'\"&$G$1&\"'!\"&\"$C$2:$H$200\"),2,FALSE),\"\")","v":"Monross Trailblazers"},{"$f":"IFERROR(VLOOKUP(B194,INDIRECT(\"'\"&$G$1&\"'!\"&\"$C$2:$H$200\"),3,FALSE),\"\")","v":"F"},{"$f":"IFERROR(VLOOKUP(B194,INDIRECT(\"'\"&$G$1&\"'!\"&\"$C$2:$H$200\"),4,FALSE),\"\")","v":"Open"},{"$f":"SUM(LARGE((H194,J194,L194,N194,P194,R194),{1,2,3,4}))","v":83.387832958648403},"03:48:14",83.387832958648403,"",0,"",0,"",0,"",0,"",0,"",0,1,83.387832958648403]
[193,"Simon Dancel",{"$f":"IFERROR(VLOOKUP(B195,INDIRECT(\"'\"&$K$1&\"'!\"&\"$C$2:$H$200\"),2,FALSE),\"\")","v":"Bristol Up & Runners"},{"$f":"IFERROR(VLOOKUP(B195,INDIRECT(\"'\"&$K$1&\"'!\"&\"$C$2:$H$200\"),3,FALSE),\"\")","v":"M"},{"$f":"IFERROR(VLOOKUP(B195,INDIRECT(\"'\"&$K$1&\"'!\"&\"$C$2:$H$200\"),4,FALSE),\"\")","v":"M40"},{"$f":"SUM(LARGE((H195,J195,L195,N195,P195,R195),{1,2,3,4}))","v":83.383094160326181},{"$f":"IFERROR(VLOOKUP(B195,INDIRECT(\"'\"&$G$1&\"'!\"&\"$C$2:$H$200\"),5,FALSE),\"\")","v":""},{"$f":"IFERROR(VLOOKUP(B195,INDIRECT(\"'\"&$G$1&\"'!\"&\"$C$2:$H$200\"),6,FALSE),0)","v":0},{"$f":"IFERROR(VLOOKUP(B195,INDIRECT(\"'\"&$I$1&\"'!\"&\"$C$2:$G$200\"),5,FALSE),\"\")","v":""},{"$f":"IFERROR(VLOOKUP(B195,INDIRECT(\"'\"&$I$1&\"'!\"&\"$C$2:$H$200\"),6,FALSE),0)","v":0},{"$f":"IFERROR(VLOOKUP(B195,INDIRECT(\"'\"&$K$1&\"'!\"&\"$C$2:$H$200\"),5,FALSE),\"\")","v":"02:01:05"},{"$f":"IFERROR(VLOOKUP(B195,INDIRECT(\"'\"&$K$1&\"'!\"&\"$C$2:$H$200\"),6,FALSE),0)","v":83.383094160326181},{"$f":"IFERROR(VLOOKUP(B195,INDIRECT(\"'\"&$M$1&\"'!\"&\"$C$2:$h$200\"),5,FALSE),\"\")","v":""},{"$f":"IFERROR(VLOOKUP(B195,INDIRECT(\"'\"&$M$1&\"'!\"&\"$C$2:$h$200\"),6,FALSE),0)","v":0},{"$f":"IFERROR(VLOOKUP(B195,INDIRECT(\"'\"&$O$1&\"'!\"&\"$C$2:$h$200\"),5,FALSE),\"\")","v":""},{"$f":"IFERROR(VLOOKUP(B195,INDIRECT(\"'\"&$O$1&\"'!\"&\"$C$2:$h$200\"),6,FALSE),0)","v":0},{"$f":"IFERROR(VLOOKUP(B195,INDIRECT(\"'\"&$Q$1&\"'!\"&\"$C$2:$h$200\"),5,FALSE),\"\")","v":""},{"$f":"IFERROR(VLOOKUP(B195,INDIRECT(\"'\"&$Q$1&\"'!\"&\"$C$2:$h$200\"),6,FALSE),0)","v":0},{"$f":"IFERROR(VLOOKUP(D195,INDIRECT(\"'\"&$Q$1&\"'!\"&\"$C$2:$h$200\"),5,FALSE),\"\")","v":""},{"$f":"IFERROR(VLOOKUP(D195,INDIRECT(\"'\"&$S$1&\"'!\"&\"$C$2:$h$200\"),6,FALSE),0)","v":0},{"$f":"7-COUNTIF(G195:T195,\"\")","v":1},{"$f":"F195/IF(U195>4,4,U195)","v":83.383094160326181}]
[{"$f":"ROW(A194)","v":194},"Alice Williams",{"$f":"IFERROR(VLOOKUP(B196,INDIRECT(\"'\"&$G$1&\"'!\"&\"$C$2:$H$200\"),2,FALSE),\"\")","v":"Buckley Runners"},{"$f":"IFERROR(VLOOKUP(B196,INDIRECT(\"'\"&$G$1&\"'!\"&\"$C$2:$H$200\"),3,FALSE),\"\")","v":"F"},{"$f":"IFERROR(VLOOKUP(B196,INDIRECT(\"'\"&$G$1&\"'!\"&\"$C$2:$H$200\"),4,FALSE),\"\")","v":"V40"},{"$f":"SUM(LARGE((H196,J196,L196,N196,P196,R196),{1,2,3,4}))","v":83.370801825737445},"03:48:16",83.370801825737445,"",0,"",0,"",0,"",0,"",0,"",0,1,83.370801825737445]
[195,"Peter Vokes",{"$f":"IFERROR(VLOOKUP(B197,INDIRECT(\"'\"&$G$1&\"'!\"&\"$C$2:$H$200\"),2,FALSE),\"\")","v":"N/A"},{"$f":"IFERROR(VLOOKUP(B197,INDIRECT(\"'\"&$G$1&\"'!\"&\"$C$2:$H$200\"),3,FALSE),\"\")","v":"M"},{"$f":"IFERROR(VLOOKUP(B197,INDIRECT(\"'\"&$G$1&\"'!\"&\"$C$2:$H$200\"),4,FALSE),\"\")","v":"Open"},{"$f":"SUM(LARGE((H197,J197,L197,N197,P197,R197),{1,2,3,4}))","v":83.345255126370986},"03:48:19",83.345255126370986,"",0,"",0,"",0,"",0,"",0,"",0,1,83.345255126370986]
[196,"Jill Davies",{"$f":"IFERROR(VLOOKUP(B198,INDIRECT(\"'\"&$G$1&\"'!\"&\"$C$2:$H$200\"),2,FALSE),\"\")","v":"Saddleworth Runners"},{"$f":"IFERROR(VLOOKUP(B198,INDIRECT(\"'\"&$G$1&\"'!\"&\"$C$2:$H$200\"),3,FALSE),\"\")","v":"F"},{"$f":"IFERROR(VLOOKUP(B198,INDIRECT(\"'\"&$G$1&\"'!\"&\"$C$2:$H$200\"),4,FALSE),\"\")","v":"V60"},{"$f":"SUM(LARGE((H198,J198,L198,N198,P198,R198),{1,2,3,4}))","v":81.957217794127658},"03:51:02",81.957217794127658,"",0,"",0,"",0,"",0,"",0,"",0,1,81.957217794127658]
[197,"Tim Buckley",{"$f":"IFERROR(VLOOKUP(B199,INDIRECT(\"'\"&$I$1&\"'!\"&\"$C$2:$H$200\"),2,FALSE),\"\")","v":"Chepstow Harriers"},{"$f":"IFERROR(VLOOKUP(B199,INDIRECT(\"'\"&$I$1&\"'!\"&\"$C$2:$H$200\"),3,FALSE),\"\")","v":"M"},{"$f":"IFERROR(VLOOKUP(B199,INDIRECT(\"'\"&$I$1&\"'!\"&\"$C$2:$H$200\"),4,FALSE),\"\")","v":"MV50"},{"$f":"SUM(LARGE((H199,J199,L199,N199,P199,R199),{1,2,3,4}))","v":81.402819917901127},"",0,4.614583333333333,81.402819917901127,"",0,"",0,"",0,"",0,"",0,1,81.402819917901127]
[198,"Pete Morfey",{"$f":"IFERROR(VLOOKUP(B200,INDIRECT(\"'\"&$K$1&\"'!\"&\"$C$2:$H$200\"),2,FALSE),\"\")","v":"Cardiff Harlequins"},{"$f":"IFERROR(VLOOKUP(B200,INDIRECT(\"'\"&$K$1&\"'!\"&\"$C$2:$H$200\"),3,FALSE),\"\")","v":"M"},{"$f":"IFERROR(VLOOKUP(B200,INDIRECT(\"'\"&$K$1&\"'!\"&\"$C$2:$H$200\"),4,FALSE),\"\")","v":"M60"},{"$f":"SUM(LARGE((H200,J200,L200,N200,P200,R200),{1,2,3,4}))","v":80.782689652958368},"",0,"",0,"02:03:47",80.782689652958368,"",0,"",0,"",0,"",0,1,80.782689652958368]
[199,"Paul Symons",{"$f":"IFERROR(VLOOKUP(B201,INDIRECT(\"'\"&$I$1&\"'!\"&\"$C$2:$H$200\"),2,FALSE),\"\")","v":0},{"$f":"IFERROR(VLOOKUP(B201,INDIRECT(\"'\"&$I$1&\"'!\"&\"$C$2:$H$200\"),3,FALSE),\"\")","v":"M"},{"$f":"IFERROR(VLOOKUP(B201,INDIRECT(\"'\"&$I$1&\"'!\"&\"$C$2:$H$200\"),4,FALSE),\"\")","v":"MV50"},{"$f":"SUM(LARGE((H201,J201,L201,N201,P201,R201),{1,2,3,4}))","v":80.331965018739965},"",0,4.65625,80.331965018739965,"",0,"",0,"",0,"",0,"",0,1,80.331965018739965]
[200,"Gareth Jones",{"$f":"IFERROR(VLOOKUP(B202,INDIRECT(\"'\"&$K$1&\"'!\"&\"$C$2:$H$200\"),2,FALSE),\"\")","v":"MDC"},{"$f":"IFERROR(VLOOKUP(B202,INDIRECT(\"'\"&$K$1&\"'!\"&\"$C$2:$H$200\"),3,FALSE),\"\")","v":"M"},{"$f":"IFERROR(VLOOKUP(B202,INDIRECT(\"'\"&$K$1&\"'!\"&\"$C$2:$H$200\"),4,FALSE),\"\")","v":"M70"},{"$f":"SUM(LARGE((H202,J202,L202,N202,P202,R202),{1,2,3,4}))","v":78.663841535843844},"",0,"",0,"02:05:59",78.663841535843844,"",0,"",0,"",0,"",0,1,78.663841535843844]
[201,"Hamish Hughson",{"$f":"IFERROR(VLOOKUP(B203,INDIRECT(\"'\"&$I$1&\"'!\"&\"$C$2:$H$200\"),2,FALSE),\"\")","v":"Chepstow Harriers"},{"$f":"IFERROR(VLOOKUP(B203,INDIRECT(\"'\"&$I$1&\"'!\"&\"$C$2:$H$200\"),3,FALSE),\"\")","v":"M"},{"$f":"IFERROR(VLOOKUP(B203,INDIRECT(\"'\"&$I$1&\"'!\"&\"$C$2:$H$200\"),4,FALSE),\"\")","v":"MV40"},{"$f":"SUM(LARGE((H203,J203,L203,N203,P203,R203),{1,2,3,4}))","v":77.708370515795082},"",0,4.7583333333333337,77.708370515795082,"",0,"",0,"",0,"",0,"",0,1,77.708370515795082]
[202,"Archie Gemell",{"$f":"IFERROR(VLOOKUP(B204,INDIRECT(\"'\"&$I$1&\"'!\"&\"$C$2:$H$200\"),2,FALSE),\"\")","v":0},{"$f":"IFERROR(VLOOKUP(B204,INDIRECT(\"'\"&$I$1&\"'!\"&\"$C$2:$H$200\"),3,FALSE),\"\")","v":"M"},{"$f":"IFERROR(VLOOKUP(B204,INDIRECT(\"'\"&$I$1&\"'!\"&\"$C$2:$H$200\"),4,FALSE),\"\")","v":"MV50"},{"$f":"SUM(LARGE((H204,J204,L204,N204,P204,R204),{1,2,3,4}))","v":76.905229341424231},"",0,4.7895833333333337,76.905229341424231,"",0,"",0,"",0,"",0,"",0,1,76.905229341424231]
[203,"Flora Gunner",{"$f":"IFERROR(VLOOKUP(B205,INDIRECT(\"'\"&$I$1&\"'!\"&\"$C$2:$H$200\"),2,FALSE),\"\")","v":"Croft Ambrey RC"},{"$f":"IFERROR(VLOOKUP(B205,INDIRECT(\"'\"&$I$1&\"'!\"&\"$C$2:$H$200\"),3,FALSE),\"\")","v":"F"},{"$f":"IFERROR(VLOOKUP(B205,INDIRECT(\"'\"&$I$1&\"'!\"&\"$C$2:$H$200\"),4,FALSE),\"\")","v":"MV50"},{"$f":"SUM(LARGE((H205,J205,L205,N205,P205,R205),{1,2,3,4}))","v":76.155630912011404},"",0,4.8187500000000005,76.155630912011404,"",0,"",0,"",0,"",0,"",0,1,76.155630912011404]
[204,"John Price",{"$f":"IFERROR(VLOOKUP(B206,INDIRECT(\"'\"&$I$1&\"'!\"&\"$C$2:$H$200\"),2,FALSE),\"\")","v":"Hay Hotfooters"},{"$f":"IFERROR(VLOOKUP(B206,INDIRECT(\"'\"&$I$1&\"'!\"&\"$C$2:$H$200\"),3,FALSE),\"\")","v":"M"},{"$f":"IFERROR(VLOOKUP(B206,INDIRECT(\"'\"&$I$1&\"'!\"&\"$C$2:$H$200\"),4,FALSE),\"\")","v":"MV60"},{"$f":"SUM(LARGE((H206,J206,L206,N206,P206,R206),{1,2,3,4}))","v":75.691593789041576},"rtd",0,4.8368055555555554,75.691593789041576,"",0,"",0,"",0,"",0,"",0,2,37.845796894520788]
[205,"Stefanie Francis",{"$f":"IFERROR(VLOOKUP(B207,INDIRECT(\"'\"&$I$1&\"'!\"&\"$C$2:$H$200\"),2,FALSE),\"\")","v":"Forest of Dean AC"},{"$f":"IFERROR(VLOOKUP(B207,INDIRECT(\"'\"&$I$1&\"'!\"&\"$C$2:$H$200\"),3,FALSE),\"\")","v":"F"},{"$f":"IFERROR(VLOOKUP(B207,INDIRECT(\"'\"&$I$1&\"'!\"&\"$C$2:$H$200\"),4,FALSE),\"\")","v":"MV50"},{"$f":"SUM(LARGE((H207,J207,L207,N207,P207,R207),{1,2,3,4}))","v":74.870605033018037},"",0,4.8687499999999995,74.870605033018037,"",0,"",0,"",0,"",0,"",0,1,74.870605033018037]
[206,"Gareth D Jones",{"$f":"IFERROR(VLOOKUP(B208,INDIRECT(\"'\"&$G$1&\"'!\"&\"$C$2:$H$200\"),2,FALSE),\"\")","v":"MDC"},{"$f":"IFERROR(VLOOKUP(B208,INDIRECT(\"'\"&$G$1&\"'!\"&\"$C$2:$H$200\"),3,FALSE),\"\")","v":"M"},{"$f":"IFERROR(VLOOKUP(B208,INDIRECT(\"'\"&$G$1&\"'!\"&\"$C$2:$H$200\"),4,FALSE),\"\")","v":"V70"},{"$f":"SUM(LARGE((H208,J208,L208,N208,P208,R208),{1,2,3,4}))","v":74.591252810136922},"04:05:27",74.591252810136922,"",0,"",0,"",0,"",0,"",0,"",0,1,74.591252810136922]
[207,"Dougal Davrvill",{"$f":"IFERROR(VLOOKUP(B209,INDIRECT(\"'\"&$G$1&\"'!\"&\"$C$2:$H$200\"),2,FALSE),\"\")","v":"N/A"},{"$f":"IFERROR(VLOOKUP(B209,INDIRECT(\"'\"&$G$1&\"'!\"&\"$C$2:$H$200\"),3,FALSE),\"\")","v":"M"},{"$f":"IFERROR(VLOOKUP(B209,INDIRECT(\"'\"&$G$1&\"'!\"&\"$C$2:$H$200\"),4,FALSE),\"\")","v":"V50"},{"$f":"SUM(LARGE((H209,J209,L209,N209,P209,R209),{1,2,3,4}))","v":74.557190544315006},"04:05:31",74.557190544315006,"",0,"",0,"",0,"",0,"",0,"",0,1,74.557190544315006]
[208,"Tom Davies",{"$f":"IFERROR(VLOOKUP(B210,INDIRECT(\"'\"&$I$1&\"'!\"&\"$C$2:$H$200\"),2,FALSE),\"\")","v":"Croft Ambrey RC"},{"$f":"IFERROR(VLOOKUP(B210,INDIRECT(\"'\"&$I$1&\"'!\"&\"$C$2:$H$200\"),3,FALSE),\"\")","v":"M"},{"$f":"IFERROR(VLOOKUP(B210,INDIRECT(\"'\"&$I$1&\"'!\"&\"$C$2:$H$200\"),4,FALSE),\"\")","v":"MV65"},{"$f":"SUM(LARGE((H210,J210,L210,N210,P210,R210),{1,2,3,4}))","v":71.890058897019443},"",0,4.9847222222222225,71.890058897019443,"",0,"",0,"",0,"",0,"",0,1,71.890058897019443]
[209,"Charlotte Goodwin",{"$f":"IFERROR(VLOOKUP(B211,INDIRECT(\"'\"&$I$1&\"'!\"&\"$C$2:$H$200\"),2,FALSE),\"\")","v":0},{"$f":"IFERROR(VLOOKUP(B211,INDIRECT(\"'\"&$I$1&\"'!\"&\"$C$2:$H$200\"),3,FALSE),\"\")","v":"F"},{"$f":"IFERROR(VLOOKUP(B211,INDIRECT(\"'\"&$I$1&\"'!\"&\"$C$2:$H$200\"),4,FALSE),\"\")","v":"SM"},{"$f":"SUM(LARGE((H211,J211,L211,N211,P211,R211),{1,2,3,4}))","v":71.675887917187225},"",0,4.9930555555555554,71.675887917187225,"",0,"",0,"",0,"",0,"",0,1,71.675887917187225]
[210,"Jonathan Humphries",{"$f":"IFERROR(VLOOKUP(B212,INDIRECT(\"'\"&$K$1&\"'!\"&\"$C$2:$H$200\"),2,FALSE),\"\")","v":0},{"$f":"IFERROR(VLOOKUP(B212,INDIRECT(\"'\"&$K$1&\"'!\"&\"$C$2:$H$200\"),3,FALSE),\"\")","v":"M"},{"$f":"IFERROR(VLOOKUP(B212,INDIRECT(\"'\"&$K$1&\"'!\"&\"$C$2:$H$200\"),4,FALSE),\"\")","v":"M"},{"$f":"SUM(LARGE((H212,J212,L212,N212,P212,R212),{1,2,3,4}))","v":71.584962599120345},"",0,"",0,"02:13:20",71.584962599120345,"",0,"",0,"",0,"",0,1,71.584962599120345]
[211,"Rod Sutcliffe",{"$f":"IFERROR(VLOOKUP(B213,INDIRECT(\"'\"&$G$1&\"'!\"&\"$C$2:$H$200\"),2,FALSE),\"\")","v":"Calder Valley"},{"$f":"IFERROR(VLOOKUP(B213,INDIRECT(\"'\"&$G$1&\"'!\"&\"$C$2:$H$200\"),3,FALSE),\"\")","v":"M"},{"$f":"IFERROR(VLOOKUP(B213,INDIRECT(\"'\"&$G$1&\"'!\"&\"$C$2:$H$200\"),4,FALSE),\"\")","v":"V60"},{"$f":"SUM(LARGE((H213,J213,L213,N213,P213,R213),{1,2,3,4}))","v":71.142448395667273},"04:12:12",71.142448395667273,"",0,"",0,"",0,"",0,"",0,"",0,1,71.142448395667273]
[212,"Rebecca Smith-Williams",{"$f":"IFERROR(VLOOKUP(B214,INDIRECT(\"'\"&$G$1&\"'!\"&\"$C$2:$H$200\"),2,FALSE),\"\")","v":"MDC"},{"$f":"IFERROR(VLOOKUP(B214,INDIRECT(\"'\"&$G$1&\"'!\"&\"$C$2:$H$200\"),3,FALSE),\"\")","v":"F"},{"$f":"IFERROR(VLOOKUP(B214,INDIRECT(\"'\"&$G$1&\"'!\"&\"$C$2:$H$200\"),4,FALSE),\"\")","v":"Open"},{"$f":"SUM(LARGE((H214,J214,L214,N214,P214,R214),{1,2,3,4}))","v":65.028271680632187},"04:24:10",65.028271680632187,"",0,"",0,"",0,"",0,"",0,"",0,1,65.028271680632187]
[213,"William Darby",{"$f":"IFERROR(VLOOKUP(B215,INDIRECT(\"'\"&$I$1&\"'!\"&\"$C$2:$H$200\"),2,FALSE),\"\")","v":"Mynydd Du"},{"$f":"IFERROR(VLOOKUP(B215,INDIRECT(\"'\"&$I$1&\"'!\"&\"$C$2:$H$200\"),3,FALSE),\"\")","v":"M"},{"$f":"IFERROR(VLOOKUP(B215,INDIRECT(\"'\"&$I$1&\"'!\"&\"$C$2:$H$200\"),4,FALSE),\"\")","v":"MV60"},{"$f":"SUM(LARGE((H215,J215,L215,N215,P215,R215),{1,2,3,4}))","v":64.001427806532192},"",0,5.291666666666667,64.001427806532192,"",0,"",0,"",0,"",0,"",0,1,64.001427806532192]
[214,"Jack Hayon Harington",{"$f":"IFERROR(VLOOKUP(B216,INDIRECT(\"'\"&$G$1&\"'!\"&\"$C$2:$H$200\"),2,FALSE),\"\")","v":"Frome Running Club"},{"$f":"IFERROR(VLOOKUP(B216,INDIRECT(\"'\"&$G$1&\"'!\"&\"$C$2:$H$200\"),3,FALSE),\"\")","v":"M"},{"$f":"IFERROR(VLOOKUP(B216,INDIRECT(\"'\"&$G$1&\"'!\"&\"$C$2:$H$200\"),4,FALSE),\"\")","v":"Open"},{"$f":"SUM(LARGE((H216,J216,L216,N216,P216,R216),{1,2,3,4}))","v":63.45289188636827},"04:27:15",63.45289188636827,"",0,"",0,"",0,"",0,"",0,"",0,1,63.45289188636827]
[215,"Chris Hawkins",{"$f":"IFERROR(VLOOKUP(B217,INDIRECT(\"'\"&$I$1&\"'!\"&\"$C$2:$H$200\"),2,FALSE),\"\")","v":"Forest of Dean AC"},{"$f":"IFERROR(VLOOKUP(B217,INDIRECT(\"'\"&$I$1&\"'!\"&\"$C$2:$H$200\"),3,FALSE),\"\")","v":"M"},{"$f":"IFERROR(VLOOKUP(B217,INDIRECT(\"'\"&$I$1&\"'!\"&\"$C$2:$H$200\"),4,FALSE),\"\")","v":"MV65"},{"$f":"SUM(LARGE((H217,J217,L217,N217,P217,R217),{1,2,3,4}))","v":61.395680885240033},"",0,5.3930555555555557,61.395680885240033,"",0,"",0,"",0,"",0,"",0,1,61.395680885240033]
[216,"Liselette Adams",{"$f":"IFERROR(VLOOKUP(B218,INDIRECT(\"'\"&$I$1&\"'!\"&\"$C$2:$H$200\"),2,FALSE),\"\")","v":"FODAC"},{"$f":"IFERROR(VLOOKUP(B218,INDIRECT(\"'\"&$I$1&\"'!\"&\"$C$2:$H$200\"),3,FALSE),\"\")","v":"F"},{"$f":"IFERROR(VLOOKUP(B218,INDIRECT(\"'\"&$I$1&\"'!\"&\"$C$2:$H$200\"),4,FALSE),\"\")","v":"FV40"},{"$f":"SUM(LARGE((H218,J218,L218,N218,P218,R218),{1,2,3,4}))","v":61.395680885240033},"",0,5.3930555555555557,61.395680885240033,"",0,"",0,"",0,"",0,"",0,1,61.395680885240033]
[217,"claire carden",{"$f":"IFERROR(VLOOKUP(B219,INDIRECT(\"'\"&$I$1&\"'!\"&\"$C$2:$H$200\"),2,FALSE),\"\")","v":"none"},{"$f":"IFERROR(VLOOKUP(B219,INDIRECT(\"'\"&$I$1&\"'!\"&\"$C$2:$H$200\"),3,FALSE),\"\")","v":"F"},{"$f":"IFERROR(VLOOKUP(B219,INDIRECT(\"'\"&$I$1&\"'!\"&\"$C$2:$H$200\"),4,FALSE),\"\")","v":"MV40"},{"$f":"SUM(LARGE((H219,J219,L219,N219,P219,R219),{1,2,3,4}))","v":60.182045332857406},"",0,5.4402777777777773,60.182045332857406,"",0,"",0,"",0,"",0,"",0,1,60.182045332857406]
[218,"Matthew Knight",{"$f":"IFERROR(VLOOKUP(B220,INDIRECT(\"'\"&$I$1&\"'!\"&\"$C$2:$H$200\"),2,FALSE),\"\")","v":"Hereford Couriers"},{"$f":"IFERROR(VLOOKUP(B220,INDIRECT(\"'\"&$I$1&\"'!\"&\"$C$2:$H$200\"),3,FALSE),\"\")","v":"M"},{"$f":"IFERROR(VLOOKUP(B220,INDIRECT(\"'\"&$I$1&\"'!\"&\"$C$2:$H$200\"),4,FALSE),\"\")","v":"SM"},{"$f":"SUM(LARGE((H220,J220,L220,N220,P220,R220),{1,2,3,4}))","v":56.755309655541652},"",0,5.573611111111112,56.755309655541652,"",0,"",0,"",0,"",0,"",0,1,56.755309655541652]
[219,"Paul Colley-Davies",{"$f":"IFERROR(VLOOKUP(B221,INDIRECT(\"'\"&$I$1&\"'!\"&\"$C$2:$H$200\"),2,FALSE),\"\")","v":"Croft Ambrey RC"},{"$f":"IFERROR(VLOOKUP(B221,INDIRECT(\"'\"&$I$1&\"'!\"&\"$C$2:$H$200\"),3,FALSE),\"\")","v":"M"},{"$f":"IFERROR(VLOOKUP(B221,INDIRECT(\"'\"&$I$1&\"'!\"&\"$C$2:$H$200\"),4,FALSE),\"\")","v":"MV50"},{"$f":"SUM(LARGE((H221,J221,L221,N221,P221,R221),{1,2,3,4}))","v":56.737462073888992},"",0,5.5743055555555552,56.737462073888992,"",0,"",0,"",0,"",0,"",0,1,56.737462073888992]
[220,"Robert Wood",{"$f":"IFERROR(VLOOKUP(B222,INDIRECT(\"'\"&$G$1&\"'!\"&\"$C$2:$H$200\"),2,FALSE),\"\")","v":"Lliswerry Runners"},{"$f":"IFERROR(VLOOKUP(B222,INDIRECT(\"'\"&$G$1&\"'!\"&\"$C$2:$H$200\"),3,FALSE),\"\")","v":"M"},{"$f":"IFERROR(VLOOKUP(B222,INDIRECT(\"'\"&$G$1&\"'!\"&\"$C$2:$H$200\"),4,FALSE),\"\")","v":"V40"},{"$f":"SUM(LARGE((H222,J222,L222,N222,P222,R222),{1,2,3,4}))","v":36.790653314258456},"05:19:26",36.790653314258456,"",0,"",0,"",0,"",0,"",0,"",0,1,36.790653314258456]
[221,"Steven Hepton",{"$f":"IFERROR(VLOOKUP(B223,INDIRECT(\"'\"&$K$1&\"'!\"&\"$C$2:$H$200\"),2,FALSE),\"\")","v":""},{"$f":"IFERROR(VLOOKUP(B223,INDIRECT(\"'\"&$K$1&\"'!\"&\"$C$2:$H$200\"),3,FALSE),\"\")","v":""},{"$f":"IFERROR(VLOOKUP(B223,INDIRECT(\"'\"&$K$1&\"'!\"&\"$C$2:$H$200\"),4,FALSE),\"\")","v":""},{"$f":"SUM(LARGE((H223,J223,L223,N223,P223,R223),{1,2,3,4}))","v":0},"",0,"",0,"",0,"",0,"",0,"",0,"",0,0,{"$error":"#DIV/0!"}]
[222,"Helen  Brown",{"$f":"IFERROR(VLOOKUP(B224,INDIRECT(\"'\"&$I$1&\"'!\"&\"$C$2:$H$200\"),2,FALSE),\"\")","v":""},{"$f":"IFERROR(VLOOKUP(B224,INDIRECT(\"'\"&$I$1&\"'!\"&\"$C$2:$H$200\"),3,FALSE),\"\")","v":""},{"$f":"IFERROR(VLOOKUP(B224,INDIRECT(\"'\"&$I$1&\"'!\"&\"$C$2:$H$200\"),4,FALSE),\"\")","v":""},{"$f":"SUM(LARGE((H224,J224,L224,N224,P224,R224),{1,2,3,4}))","v":0},"",0,"",0,"",0,"",0,"",0,"",0,"",0,0,{"$error":"#DIV/0!"}]
[223,"Hayley  Evans",{"$f":"IFERROR(VLOOKUP(B225,INDIRECT(\"'\"&$I$1&\"'!\"&\"$C$2:$H$200\"),2,FALSE),\"\")","v":""},{"$f":"IFERROR(VLOOKUP(B225,INDIRECT(\"'\"&$I$1&\"'!\"&\"$C$2:$H$200\"),3,FALSE),\"\")","v":""},{"$f":"IFERROR(VLOOKUP(B225,INDIRECT(\"'\"&$I$1&\"'!\"&\"$C$2:$H$200\"),4,FALSE),\"\")","v":""},{"$f":"SUM(LARGE((H225,J225,L225,N225,P225,R225),{1,2,3,4}))","v":0},"",0,"",0,"",0,"",0,"",0,"",0,"",0,0,{"$error":"#DIV/0!"}]
[224,"Annie Dobson",{"$f":"IFERROR(VLOOKUP(B226,INDIRECT(\"'\"&$G$1&\"'!\"&\"$C$2:$H$200\"),2,FALSE),\"\")","v":"IND"},{"$f":"IFERROR(VLOOKUP(B226,INDIRECT(\"'\"&$G$1&\"'!\"&\"$C$2:$H$200\"),3,FALSE),\"\")","v":"F"},{"$f":"IFERROR(VLOOKUP(B226,INDIRECT(\"'\"&$G$1&\"'!\"&\"$C$2:$H$200\"),4,FALSE),\"\")","v":"V40"},{"$f":"SUM(LARGE((H226,J226,L226,N226,P226,R226),{1,2,3,4}))","v":0},"rtd",0,"",0,"",0,"",0,"",0,"",0,"",0,1,0]
[225,"Daniela Gormley (SWEEPER)",{"$f":"IFERROR(VLOOKUP(B227,INDIRECT(\"'\"&$G$1&\"'!\"&\"$C$2:$H$200\"),2,FALSE),\"\")","v":"Mynydd Du"},{"$f":"IFERROR(VLOOKUP(B227,INDIRECT(\"'\"&$G$1&\"'!\"&\"$C$2:$H$200\"),3,FALSE),\"\")","v":"F"},{"$f":"IFERROR(VLOOKUP(B227,INDIRECT(\"'\"&$G$1&\"'!\"&\"$C$2:$H$200\"),4,FALSE),\"\")","v":"V40"},{"$f":"SUM(LARGE((H227,J227,L227,N227,P227,R227),{1,2,3,4}))","v":0},"rtd",0,"",0,"",0,"",0,"",0,"",0,"",0,1,0]
[226,"Richard Born",{"$f":"IFERROR(VLOOKUP(B228,INDIRECT(\"'\"&$G$1&\"'!\"&\"$C$2:$H$200\"),2,FALSE),\"\")","v":"Mysteruns"},{"$f":"IFERROR(VLOOKUP(B228,INDIRECT(\"'\"&$G$1&\"'!\"&\"$C$2:$H$200\"),3,FALSE),\"\")","v":"M"},{"$f":"IFERROR(VLOOKUP(B228,INDIRECT(\"'\"&$G$1&\"'!\"&\"$C$2:$H$200\"),4,FALSE),\"\")","v":"V50"},{"$f":"SUM(LARGE((H228,J228,L228,N228,P228,R228),{1,2,3,4}))","v":0},"rtd",0,"",0,"",0,"",0,"",0,"",0,"",0,1,0]
[227,null,{"$f":"IFERROR(VLOOKUP(B229,INDIRECT(\"'\"&$K$1&\"'!\"&\"$C$2:$H$200\"),2,FALSE),\"\")","v":""},{"$f":"IFERROR(VLOOKUP(B229,INDIRECT(\"'\"&$K$1&\"'!\"&\"$C$2:$H$200\"),3,FALSE),\"\")","v":""},{"$f":"IFERROR(VLOOKUP(B229,INDIRECT(\"'\"&$K$1&\"'!\"&\"$C$2:$H$200\"),4,FALSE),\"\")","v":""},{"$f":"SUM(LARGE((H229,J229,L229,N229,P229,R229),{1,2,3,4}))","v":0},"",0,"",0,"",0,"",0,"",0,"",0,"",0,0,{"$error":"#DIV/0!"}]
[228,null,"","","",{"$f":"SUM(LARGE((H230,J230,L230,N230,P230,R230),{1,2,3,4}))","v":0},"",0,"",0,"",0,"",0,"",0,"",0,"",0,0,{"$error":"#DIV/0!"}]
[229,null,"","","",{"$f":"SUM(LARGE((H231,J231,L231,N231,P231,R231),{1,2,3,4}))","v":0},"",0,"",0,"",0,"",0,"",0,"",0,"",0,0,{"$error":"#DIV/0!"}]
[230,null,"","","",{"$f":"SUM(LARGE((H232,J232,L232,N232,P232,R232),{1,2,3,4}))","v":0},"",0,"",0,"",0,"",0,"",0,"",0,"",0,0,{"$error":"#DIV/0!"}]
[231,null,"","","",{"$f":"SUM(LARGE((H233,J233,L233,N233,P233,R233),{1,2,3,4}))","v":0},"",0,"",0,"",0,"",0,"",0,"",0,"",0,0,{"$error":"#DIV/0!"}]
[232,null,"","","",{"$f":"SUM(LARGE((H234,J234,L234,N234,P234,R234),{1,2,3,4}))","v":0},"",0,"",0,"",0,"",0,"",0,"",0,"",0,0,{"$error":"#DIV/0!"}]
[233,null,"","","",{"$f":"SUM(LARGE((H235,J235,L235,N235,P235,R235),{1,2,3,4}))","v":0},"",0,"",0,"",0,"",0,"",0,"",0,"",0,0,{"$error":"#DIV/0!"}]
[234,null,"","","",{"$f":"SUM(LARGE((H236,J236,L236,N236,P236,R236),{1,2,3,4}))","v":0},"",0,"",0,"",0,"",0,"",0,"",0,"",0,0,{"$error":"#DIV/0!"}]
[235,null,"","","",{"$f":"SUM(LARGE((H237,J237,L237,N237,P237,R237),{1,2,3,4}))","v":0},"",0,"",0,"",0,"",0,"",0,"",0,"",0,0,{"$error":"#DIV/0!"}]
[236,null,"","","",{"$f":"SUM(LARGE((H238,J238,L238,N238,P238,R238),{1,2,3,4}))","v":0},"",0,"",0,"",0,"",0,"",0,"",0,"",0,0,{"$error":"#DIV/0!"}]
[237,null,"","","",{"$f":"SUM(LARGE((H239,J239,L239,N239,P239,R239),{1,2,3,4}))","v":0},"",0,"",0,"",0,"",0,"",0,"",0,"",0,0,{"$error":"#DIV/0!"}]
[238,null,"","","",{"$f":"SUM(LARGE((H240,J240,L240,N240,P240,R240),{1,2,3,4}))","v":0},"",0,"",0,"",0,"",0,"",0,"",0,"",0,0,{"$error":"#DIV/0!"}]
[239,null,"","","",{"$f":"SUM(LARGE((H241,J241,L241,N241,P241,R241),{1,2,3,4}))","v":0},"",0,"",0,"",0,"",0,"",0,"",0,"",0,0,{"$error":"#DIV/0!"}]
[240,null,"","","",{"$f":"SUM(LARGE((H242,J242,L242,N242,P242,R242),{1,2,3,4}))","v":0},"",0,"",0,"",0,"",0,"",0,"",0,"",0,0,{"$error":"#DIV/0!"}]
[241,null,"","","",{"$f":"SUM(LARGE((H243,J243,L243,N243,P243,R243),{1,2,3,4}))","v":0},"",0,"",0,"",0,"",0,"",0,"",0,"",0,0,{"$error":"#DIV/0!"}]
[242,null,"","","",{"$f":"SUM(LARGE((H244,J244,L244,N244,P244,R244),{1,2,3,4}))","v":0},"",0,"",0,"",0,"",0,"",0,"",0,"",0,0,{"$error":"#DIV/0!"}]
[243,null,"","","",{"$f":"SUM(LARGE((H245,J245,L245,N245,P245,R245),{1,2,3,4}))","v":0},"",0,"",0,"",0,"",0,"",0,"",0,"",0,0,{"$error":"#DIV/0!"}]
[244,null,"","","",{"$f":"SUM(LARGE((H246,J246,L246,N246,P246,R246),{1,2,3,4}))","v":0},"",0,"",0,"",0,"",0,"",0,"",0,"",0,0,{"$error":"#DIV/0!"}]
[245,null,"","","",{"$f":"SUM(LARGE((H247,J247,L247,N247,P247,R247),{1,2,3,4}))","v":0},"",0,"",0,"",0,"",0,"",0,"",0,"",0,0,{"$error":"#DIV/0!"}]
[246,null,"","","",{"$f":"SUM(LARGE((H248,J248,L248,N248,P248,R248),{1,2,3,4}))","v":0},"",0,"",0,"",0,"",0,"",0,"",0,"",0,0,{"$error":"#DIV/0!"}]
[247,null,"","","",{"$f":"SUM(LARGE((H249,J249,L249,N249,P249,R249),{1,2,3,4}))","v":0},"",0,"",0,"",0,"",0,"",0,"",0,"",0,0,{"$error":"#DIV/0!"}]
[248,null,"","","",{"$f":"SUM(LARGE((H250,J250,L250,N250,P250,R250),{1,2,3,4}))","v":0},"",0,"",0,"",0,"",0,"",0,"",0,"",0,0,{"$error":"#DIV/0!"}]
[249,null,"","","",{"$f":"SUM(LARGE((H251,J251,L251,N251,P251,R251),{1,2,3,4}))","v":0},"",0,"",0,"",0,"",0,"",0,"",0,"",0,0,{"$error":"#DIV/0!"}]
[250,null,"","","",{"$f":"SUM(LARGE((H252,J252,L252,N252,P252,R252),{1,2,3,4}))","v":0},"",0,"",0,"",0,"",0,"",0,"",0,"",0,0,{"$error":"#DIV/0!"}]
[251,null,"","","",{"$f":"SUM(LARGE((H253,J253,L253,N253,P253,R253),{1,2,3,4}))","v":0},"",0,"",0,"",0,"",0,"",0,"",0,"",0,0,{"$error":"#DIV/0!"}]
[252,null,"","","",{"$f":"SUM(LARGE((H254,J254,L254,N254,P254,R254),{1,2,3,4}))","v":0},"",0,"",0,"",0,"",0,"",0,"",0,"",0,0,{"$error":"#DIV/0!"}]
[253,null,"","","",{"$f":"SUM(LARGE((H255,J255,L255,N255,P255,R255),{1,2,3,4}))","v":0},"",0,"",0,"",0,"",0,"",0,"",0,"",0,0,{"$error":"#DIV/0!"}]
[254,null,"","","",{"$f":"SUM(LARGE((H256,J256,L256,N256,P256,R256),{1,2,3,4}))","v":0},"",0,"",0,"",0,"",0,"",0,"",0,"",0,0,{"$error":"#DIV/0!"}]
[255,null,"","","",{"$f":"SUM(LARGE((H257,J257,L257,N257,P257,R257),{1,2,3,4}))","v":0},"",0,"",0,"",0,"",0,"",0,"",0,"",0,0,{"$error":"#DIV/0!"}]
[256,null,"","","",{"$f":"SUM(LARGE((H258,J258,L258,N258,P258,R258),{1,2,3,4}))","v":0},"",0,"",0,"",0,"",0,"",0,"",0,"",0,0,{"$error":"#DIV/0!"}]

{"sheet":"Llanbedr 2 Bleanafon","index":2,"n_rows":122,"n_cols":12,"rows_kept":122,"cut":false,"hidden":false,"merged":[]}
["Position","Number","Name","Club","Gender","Category","Time","Points"]
[1,552,"Charlie Lowther","Mynydd Du","M","V40","02:14:22",{"$f":"(2-(G2/L$10))*100","v":131.34750323591524}]
[{"$f":"A2+1","v":2},530,"Hugh Aggleton","MDC","M","Open","02:15:29",{"$f":"(2-(G3/L$10))*100","v":130.77696028339804},null,"Number of runners","Position","Time (min.sec)"]
[{"$f":"A3+1","v":3},575,"Peter Ryder","Aberdare Valley","M","Open","02:15:35",130.72586688466515,null,{"$f":"COUNT(B2:B201)","v":121},{"$f":"K6+2","v":63},{"$f":"VLOOKUP(K4,A$2:G$201,7,FALSE)","v":"03:18:15"}]
[4,496,"Matt O'Keefe","MDC","M","Open","02:27:24",124.68833026772941,null,{"$f":"ISEVEN(J4)","v":false},{"$f":"K6+1","v":62},{"$f":"VLOOKUP(K5,A$2:G$201,7,FALSE)","v":"03:16:43"}]
[5,531,"Richard Roberts","Eryri Harriers","M","Open","02:28:51",123.94747598610259,null,null,{"$f":"IF(J5 = TRUE,(J4/2),((J4+1)/2))","v":61},"03:14:43"]
[6,577,"Jez Brown","Buckley Runners","M","V40","02:29:07",123.8112269228149,null,null,{"$f":"K6-1","v":60},"03:14:40"]
[7,502,"Martin Humphreys","Stroud AC","M","V40","02:29:09",123.79419578990394,null,null,{"$f":"K6-2","v":59},"03:14:15"]
[8,514,"Dan Sandford","Forest of Dean AC","M","V40","02:31:11",122.75529668233531,null,null,{"$f":"IF(J5 = TRUE, K6-3, \" \")","v":" "}]
[9,556,"Andrew Salt","Croft Ambrey","M","Open","02:31:21",122.67014101778048,null,null,null,{"$f":"IF(J5=TRUE,AVERAGE(L4:L9),AVERAGE(L4:L8))","v":"03:15:43.200"}]
[10,494,"Stuart Bellamy","Mercia Fell Runners","M","V40","02:31:28",122.61053205259213]
[11,519,"Iestyn Awesome Rhodes","Mynydd Du","M","V40","02:31:44",122.47428298930446]
[12,534,"Evan Davies","Mynydd Du","M","U23","02:35:19",120.64343620137609]
[13,592,"Andrew Stephens","Monross Trailblazers","M","V40","02:35:32",120.53273383745487]
[14,548,"Oliver Blomfield","Eden Runners","M","V40","02:39:27",118.53157572041692]
[15,571,"Stephen Jones","Eryri Harriers","M","V60","02:39:31",118.49751345459501]
[16,524,"Helen Brown","Mynydd Du","F","V40","02:41:09",117.66298794195791]
[17,529,"Leon Davies","NWRRC","M","V40","02:41:29",117.49267661284826]
[18,481,"Andy Davies","Mercia","M","V50","02:41:52",117.29681858437222]
[19,522,"Craig Jones","Eryri Harriers","M","V40","02:42:22",117.04135159070781]
[20,550,"Paul Jeggo","Springfield","M","V50","02:43:43",116.35159070781387]
[21,497,"Dave Powell","Aberystwyth Ac","M","V50","02:44:01",116.19831051161522]
[22,493,"Katie Ironside","MDC","F","Open","02:45:30",115.44042509707747]
[23,512,"Ian Whitstance","Mynydd Du","M","V40","02:46:05",115.14238027113564]
[24,576,"Hayley Evans","Buckley Runners","F","Open","02:46:34",114.89542884392669]
[25,596,"Mark Edward Hopkinson","Mymydd Du","M","Open","02:46:53",114.73363308127256]
[26,585,"Toby Dickens","Monross Trailblazers","M","U23","02:47:30",114.4185571224198]
[27,582,"Robert Pritchard","Monross Trailblazers","M","Open","02:48:45",113.77988963825874]
[28,564,"Sam Rayall","Pontypridd Roadents","M","V40","02:48:49",113.74582737243682]
[29,533,"John Aggleton","MDC","M","V60","02:49:48",113.24340895156344]
[30,488,"Tim Woodier","Mynydd Du","M","Open","02:51:00",112.63028816676885]
[31,555,"Anthony Powell","Maldwyn Harriers","M","V40","02:51:12",112.52810136930309]
[32,541,"Sian Williams","Hebog","F","Open","02:51:25",112.41739900538184]
[33,499,"Gary Davies","MDC","M","V40","02:53:46",111.21670413515908]
[34,578,"Andy Pritchard","Buckley Runners","M","V40","02:53:52",111.16561073642619]
[35,561,"Andrew Han","Fulham Running Club","M","Open","02:54:04",111.06342393896043]
[36,558,"Paul Beeson","Maudwyn Harriers","M","V50","02:54:40",110.75686354656311]
[37,508,"Steve 'Amazing' Hepton…","Mynydd Du","M","V40","02:55:44",110.21186729341235]
[38,597,"Martin Wright","Mynydd Du","M","V40","02:56:03",110.05007153075823]
[39,523,"Faye Johnson","Mynydd Du","F","Open","02:58:29",108.80679882825805]
[40,482,"Rhian Probert","Mynydd Du","F","V40","02:58:49",108.63648749914843]
[41,559,"Matthew Lawson","Chepstow Harriers","M","V40","02:59:46",108.15110021118603]
[42,527,"Vic Belshaw","Denbigh Harriers","M","V50","02:59:53",108.09149124599769]
[43,504,"Alan Hughes","Exeter Tri Club","M","V40","03:00:02",108.01485114789836]
[44,565,"Gary Pearson","Croft Ambrey","M","V40","03:00:06",107.98078888207642]
[45,515,"Richard Cronin","MDC","M","Open","03:03:00",106.49908031882281]
[46,487,"Tim Hargreaves","Buckley Runners","M","V50","03:03:05",106.45650248654539]
[47,591,"Sam Weale","Monross Trailblazers","M","Open","03:03:15",106.37134682199058]
[48,500,"Lou Awesomus Summers","Mynydd Du","F","V50","03:03:19",106.33728455616867]
[49,586,"Sam Harness","Monross Trailblazers","M","V40","03:03:38",106.17548879351453]
[50,492,"Oliver Lamford","MDC","M","Open","03:04:14",105.86892840111723]
[51,495,"Louise Barker","Aberystwyth Ac","F","V40","03:04:31",105.72416377137405]
[52,538,"Sammi Toop","Mynydd Du","F","Open","03:04:45",105.60494584099733]
[53,580,"Paul Tucker","Mynydd Du","M","V50","03:08:20",103.77409905306901]
[54,557,"Glyn Fletcher","Maldwyn Harriers","M","V50","03:09:09",103.35683629675046]
[55,543,"Sam Charrington","Mynydd Du","M","V40","03:09:46",103.04176033789767]
[56,516,"Sue Howarth","Mercia","F","V50","03:10:54",102.46270181892498]
[57,545,"David Mackie","Corsham Running Club","M","V40","03:11:04",102.37754615437018]
[58,501,"Luke Davies","Swansea Harriers","M","U23","03:13:11",101.29606921452414]
[59,505,"Debbie Stenner","Forest of Dean AC","F","V40","03:14:15",100.75107296137338]
[60,503,"Graeme Hughes","N/A","M","V40","03:14:40",100.53818379998636]
[61,583,"Laura Lelievre","Monross Trailblazers","F","Open","03:14:43",100.51263710061993]
[62,532,"Rhys Pippard","Mynydd Du","M","Open","03:16:43",99.490769125962245]
[63,598,"Jerome Mearcister","FRA","M","V40","03:18:15",98.707337012058034]
[64,486,"Dan Gregory","N/A","M","V40","03:20:20",97.64289120512295]
[65,547,"Tom Dudding","N/A","M","Open","03:20:28",97.574766673479132]
[66,546,"Tom Walker","N/A","M","Open","03:20:31",{"$f":"(2-(G67/L$10))*100","v":97.549219974112674}]
[{"$f":"A67+1","v":67},581,"James Fletcher","Monross Trailblazers","M","V50","03:20:40",97.472579876013342]
[68,511,"Andrew Clemant","TROT","M","V50","03:21:14",97.183050616526984]
[69,600,"Stephen Priesonall","Running Somewhere Else","M","V50","03:22:39",96.459227467811175]
[70,485,"Martin Carter","Hay Hotfooters","M","V50","03:23:31",96.016418012126167]
[71,498,"Natahniel Swain","MDC","M","Open","03:23:34",95.990871312759722]
[72,544,"Jono Simpson","N/A","M","V50","03:23:51",95.846106683016544]
[73,572,"Darren Owen","IND","M","V40","03:24:50",95.343688262143218]
[74,506,"Chris Munton","Forest of Dean AC","M","Open","03:25:40",94.917909939369153]
[75,587,"Tim Adam Oliver","Monross Trailblazers","M","V40","03:25:42",94.900878806458209]
[76,536,"Rhys Thomas","N/A","M","V40","03:25:44",94.883847673547223]
[77,535,"Meinir Jones","Mynydd Du","F","V40","03:25:48",94.849785407725307]
[78,579,"Beverley Tucker","Mynydd Du","F","V50","03:26:18",94.594318414060893]
[79,484,"Kim Braznell","Mercia","F","V60","03:26:20",94.577287281149935]
[80,525,"Rhys Ashbridge","N/A","M","Open","03:26:30",94.492131616595131]
[81,520,"Richard Stanley","Ampthill and Flitwick Flyers","M","V50","03:29:26",92.99339192043054]
[82,521,"Eluned Malone","N/A","F","Open","03:31:19",92.031132910961233]
[83,528,"Emma Collins","Denbigh Harriers","F","V50","03:31:36",91.886368281218054]
[84,567,"Andy Pollintine","IND","M","V50","03:32:00",91.681994686286529]
[85,589,"Tom Mollekin","Mynydd Du","M","Open","03:32:19",91.520198923632393]
[86,573,"Andrew Wood","IND","M","Open","03:32:38",91.358403160978256]
[87,510,"Daniel Wickham","N/A","M","Open","03:33:40",90.830438040738471]
[88,551,"Sharon Woods","Mynydd Du","F","V50","03:34:45",90.276926221132214]
[89,563,"Roger Mills","Fairwater Runners","M","V40","03:34:59",90.157708290755494]
[90,537,"Jenny Yate","Mynydd Du","F","Open","03:35:02",90.132161591389064]
[91,517,"Rhys White","N/A","M","V60","03:35:06",90.098099325567119]
[92,539,"Callum Greenaway","N/A","M","Open","03:37:31",88.863342189522427]
[93,513,"Victoria Howarth","N/A","F","Open","03:37:34",88.837795490155983]
[94,542,"Jane Lewis","N/A","F","V50","03:37:39",88.795217657878595]
[95,540,"Anthony Howells","MDC","M","V50","03:37:47",88.727093126234749]
[96,509,"John Jaspers","N/A","M","V40","03:44:27",85.320866544042502]
[97,599,"Ellie Salisbury","Eryri Harriers","F","V50","03:44:50",85.125008515566464]
[98,594,"Jim Jones","Helsby RC","M","V50","03:45:25",84.82696368962462]
[99,568,"Gareth Welch","IND","M","V40","03:45:29",84.792901423802689]
[100,570,"Karen Elvers","MDC","F","V40","03:46:00",84.528918863682804]
[101,562,"Caroline Dallimore","MDC","F","V60","03:46:27",84.298998569384807]
[102,560,"Nick Dallimore","MDC","M","V60","03:46:35",84.230874037740961]
[103,584,"Vanessa Ball","Monross Trailblazers","F","Open","03:48:14",83.387832958648403]
[104,574,"Alice Williams","Buckley Runners","F","V40","03:48:16",83.370801825737445]
[105,490,"Peter Vokes","N/A","M","Open","03:48:19",83.345255126370986]
[106,566,"Andrew Chambers","IND","M","V40","03:48:21",83.328223993460028]
[107,507,"Jill Davies","Saddleworth Runners","F","V60","03:51:02",81.957217794127658]
[108,554,"Janet Richards","Mynydd Du","F","V50","04:02:00",76.353975066421427]
[109,569,"Gareth D Jones","MDC","M","V70","04:05:27",74.591252810136922]
[110,526,"Dougal Davrvill","N/A","M","V50","04:05:31",74.557190544315006]
[111,553,"Rod Sutcliffe","Calder Valley","M","V60","04:12:12",71.142448395667273]
[112,549,"Les Williams","Rhedwyr Eryri","M","V70","04:12:23",71.048777164656983]
[113,590,"Gary Gunner","Croft Ambrey","M","V70","04:18:58",67.685128414742152]
[114,491,"Rebecca Smith-Williams","MDC","F","Open","04:24:10",65.028271680632187]
[115,518,"Jack Hayon Harington","Frome Running Club","M","Open","04:27:15",63.45289188636827]
[116,483,"Robert Wood","Lliswerry Runners","M","V40","05:19:26",36.790653314258456]
[117,595,"Andy Blackmore","MDC","M","V50","rtd",{"$error":"#VALUE!"}]
[118,588,"Annie Dobson","IND","F","V40","rtd",{"$error":"#VALUE!"}]
[119,593,"Daniela Gormley (SWEEPER)","Mynydd Du","F","V40","rtd",{"$error":"#VALUE!"}]
[120,489,"John Price","Hay Hotfooters","M","V60","rtd",{"$error":"#VALUE!"}]
[121,480,"Richard Born","Mysteruns","M","V50","rtd",{"$error":"#VALUE!"}]

{"sheet":"Longtown Loop","index":3,"n_rows":136,"n_cols":12,"rows_kept":136,"cut":false,"hidden":false,"merged":[]}
["Position","Number","Name","Club","Gender","Category","Time","Points"]
[1,null,"Mark Hopkinson","Mynydd Du ",{"$f":"IF('[2]Longtown Llanthony Loop race pr'!$E2=\"Male\",\"M\",\"F\")","v":"M"},"SM",2.8104166666666668,{"$f":"(2-(G2/L$10))*100","v":127.77083705157951}]
[2,null,"Peter Ryder","Aberdare Valley",{"$f":"IF('[2]Longtown Llanthony Loop race pr'!$E3=\"Male\",\"M\",\"F\")","v":"M"},"SM",2.8402777777777781,{"$f":"(2-(G3/L$10))*100","v":127.00339104051399},null,"Number of runners","Position","Time (min.sec)"]
[3,null,"Alec Hough","Mercia fell runners",{"$f":"IF('[2]Longtown Llanthony Loop race pr'!$E4=\"Male\",\"M\",\"F\")","v":"M"},"SM",2.9361111111111113,124.54042477244332,null,87,{"$f":"K6+2","v":46},{"$f":"VLOOKUP(K4,A2:G201,7,FALSE)","v":3.9465277777777779}]
[4,null,"Matt O'Keefe","MDC",{"$f":"IF('[2]Longtown Llanthony Loop race pr'!$E5=\"Male\",\"M\",\"F\")","v":"M"},"SM",3.0201388888888889,122.38086739246832,null,"Was it an even field?",{"$f":"K6+1","v":45},3.9375]
[5,null,"James Blore","MDC",{"$f":"IF('[2]Longtown Llanthony Loop race pr'!$E6=\"Male\",\"M\",\"F\")","v":"M"},"SM",3.0409722222222224,121.84543994288775,null,{"$f":"ISEVEN(J4)","v":false},{"$f":"IF(J6 = TRUE,(J4/2),((J4+1)/2))","v":44},3.9076388888888887]
[6,null,"Jim Masters","Wye Valley Runners",{"$f":"IF('[2]Longtown Llanthony Loop race pr'!$E7=\"Male\",\"M\",\"F\")","v":"M"},"MV40",3.1770833333333335,118.34731393896125,null,null,{"$f":"K6-1","v":43},3.8416666666666668]
[7,null,"Dan Sandford","FODAC",{"$f":"IF('[2]Longtown Llanthony Loop race pr'!$E8=\"Male\",\"M\",\"F\")","v":"M"},"MV40",3.1854166666666668,118.13314295912902,null,null,{"$f":"K6-2","v":42},3.8215277777777779]
[8,null,"Chris Chambers","Mynydd Du",{"$f":"IF('[2]Longtown Llanthony Loop race pr'!$E9=\"Male\",\"M\",\"F\")","v":"M"},"MV40",3.3145833333333332,114.81349277172943,null,null,{"$f":"IF(J6 = TRUE, K6-3, Na)","v":{"$error":"#NAME?"}},{"$error":"#NAME?"}]
[9,null,"Tom Turner","Mynydd Du",{"$f":"IF('[2]Longtown Llanthony Loop race pr'!$E10=\"Male\",\"M\",\"F\")","v":"M"},"SM",3.3208333333333333,114.65286453685523,null,null,null,{"$f":"IF(J6=TRUE,AVERAGE(L4:L9),AVERAGE(L4:L8))","v":3.8909722222222221}]
[10,null,"james brown",null,{"$f":"IF('[2]Longtown Llanthony Loop race pr'!$E11=\"Male\",\"M\",\"F\")","v":"M"},"SM",3.3430555555555554,114.08174192396929]
[11,null,"Paul Jeggo","Springfield",{"$f":"IF('[2]Longtown Llanthony Loop race pr'!$E12=\"Male\",\"M\",\"F\")","v":"M"},"MV50",3.3541666666666665,113.79618061752632]
[12,null,"Gethin Powell","Pontypridd Roadents Ac",{"$f":"IF('[2]Longtown Llanthony Loop race pr'!$E13=\"Male\",\"M\",\"F\")","v":"M"},"SM",3.3625000000000003,113.58200963769409]
[13,null,"Helen Brown","Mynydd Du",{"$f":"IF('[2]Longtown Llanthony Loop race pr'!$E14=\"Male\",\"M\",\"F\")","v":"F"},"FV40",3.4486111111111111,111.36890951276102]
[14,null,"John Aggleton","MDC",{"$f":"IF('[2]Longtown Llanthony Loop race pr'!$E15=\"Male\",\"M\",\"F\")","v":"M"},"MV60",3.4527777777777775,111.26182402284491]
[15,null,"Steven 'Amazing' Hepton…","Mynydd Du",{"$f":"IF('[2]Longtown Llanthony Loop race pr'!$E16=\"Male\",\"M\",\"F\")","v":"M"},"MV40",3.4652777777777781,110.94056755309656]
[16,null,"Vincent Kamp",null,{"$f":"IF('[2]Longtown Llanthony Loop race pr'!$E17=\"Male\",\"M\",\"F\")","v":"M"},"MV40",3.4750000000000001,110.69070140995896]
[17,null,"Jonny Woolridge",null,{"$f":"IF('[2]Longtown Llanthony Loop race pr'!$E18=\"Male\",\"M\",\"F\")","v":"M"},"SM",3.4993055555555554,110.06603605211494]
[18,null,"David Mullin","Mercia Fell Runners",{"$f":"IF('[2]Longtown Llanthony Loop race pr'!$E19=\"Male\",\"M\",\"F\")","v":"M"},"MV40",3.5013888888888887,110.01249330715687]
[19,null,"Peter Nugent","Wye Valley Runners",{"$f":"IF('[2]Longtown Llanthony Loop race pr'!$E20=\"Male\",\"M\",\"F\")","v":"M"},"SM",3.505555555555556,109.90540781724074]
[20,null,"Andy Pritchard","Buckley Runners",{"$f":"IF('[2]Longtown Llanthony Loop race pr'!$E21=\"Male\",\"M\",\"F\")","v":"M"},"MV40",3.5236111111111108,109.44137069427093]
[21,null,"Hayley Evans","Buckley Runners",{"$f":"IF('[2]Longtown Llanthony Loop race pr'!$E22=\"Male\",\"M\",\"F\")","v":"F"},"SF",3.5479166666666671,108.81670533642689]
[22,null,"Glyn Williams","Croft Ambrey RC",{"$f":"IF('[2]Longtown Llanthony Loop race pr'!$E23=\"Male\",\"M\",\"F\")","v":"M"},"MV40",3.5527777777777776,108.69177226485812]
[23,null,"Helen Marshall","Aberystwyth AC",{"$f":"IF('[2]Longtown Llanthony Loop race pr'!$E24=\"Male\",\"M\",\"F\")","v":"F"},"SF",3.556944444444444,108.584686774942]
[24,null,"Dave Powell","Aberystwyth AC",{"$f":"IF('[2]Longtown Llanthony Loop race pr'!$E25=\"Male\",\"M\",\"F\")","v":"M"},"MV50",3.5833333333333335,107.90647867213991]
[25,null,"Oliver Lamford","MDC",{"$f":"IF('[2]Longtown Llanthony Loop race pr'!$E26=\"Male\",\"M\",\"F\")","v":"M"},"SM",3.6145833333333335,107.10333749776906]
[26,null,"Paul Marratt","Hereford Triathlon Club",{"$f":"IF('[2]Longtown Llanthony Loop race pr'!$E27=\"Male\",\"M\",\"F\")","v":"M"},"MV50",3.6243055555555554,106.85347135463145]
[27,null,"Nick Dallimore","MDC",{"$f":"IF('[2]Longtown Llanthony Loop race pr'!$E28=\"Male\",\"M\",\"F\")","v":"M"},"MV60",3.6368055555555556,106.53221488488309]
[28,null,"Paul Tucker","Mynydd Du",{"$f":"IF('[2]Longtown Llanthony Loop race pr'!$E29=\"Male\",\"M\",\"F\")","v":"M"},"MV50",3.6444444444444444,106.33589148670355]
[29,null,"Donna Morris","Breccon AC",{"$f":"IF('[2]Longtown Llanthony Loop race pr'!$E30=\"Male\",\"M\",\"F\")","v":"F"},"SF",3.65,106.19311083348207]
[30,null,"Nick Syrett","Chorlton Runners",{"$f":"IF('[2]Longtown Llanthony Loop race pr'!$E31=\"Male\",\"M\",\"F\")","v":"M"},"MV40",3.6576388888888887,105.99678743530252]
[31,null,"Gareth Bradbury","MonrossTrailblazers",{"$f":"IF('[2]Longtown Llanthony Loop race pr'!$E32=\"Male\",\"M\",\"F\")","v":"M"},"MV40",3.6666666666666665,105.7647688738176]
[32,null,"Luke Wedmore",null,{"$f":"IF('[2]Longtown Llanthony Loop race pr'!$E33=\"Male\",\"M\",\"F\")","v":"M"},"SM",3.6770833333333335,105.49705514902729]
[33,null,"Richard Haynes","N/A",{"$f":"IF('[2]Longtown Llanthony Loop race pr'!$E34=\"Male\",\"M\",\"F\")","v":"M"},"MV50",3.6868055555555554,105.24718900588969]
[34,null,"Debbie Stenner","Forest of Dean AC",{"$f":"IF('[2]Longtown Llanthony Loop race pr'!$E35=\"Male\",\"M\",\"F\")","v":"F"},"FV40",3.692361111111111,105.10440835266822]
[35,null,"Rhian Probert","Mynydd Du",{"$f":"IF('[2]Longtown Llanthony Loop race pr'!$E36=\"Male\",\"M\",\"F\")","v":"F"},"FV40",3.6979166666666665,104.96162769944672]
[36,null,"Orlando Timmerman",null,{"$f":"IF('[2]Longtown Llanthony Loop race pr'!$E37=\"Male\",\"M\",\"F\")","v":"M"},"SM",3.7083333333333335,104.69391397465641]
[37,null,"Andy Creber","Mynydd Du",{"$f":"IF('[2]Longtown Llanthony Loop race pr'!$E38=\"Male\",\"M\",\"F\")","v":"M"},"MV60",3.7180555555555554,104.44404783151882]
[38,null,"Matthew Haynes","Builth & District RC",{"$f":"IF('[2]Longtown Llanthony Loop race pr'!$E39=\"Male\",\"M\",\"F\")","v":"M"},"MV40",3.7256944444444446,104.24772443333927]
[39,null,"Ross  Walker","Chepstow Harriers",{"$f":"IF('[2]Longtown Llanthony Loop race pr'!$E40=\"Male\",\"M\",\"F\")","v":"M"},"MV40",3.755555555555556,103.48027842227377]
[40,null,"alex banks","Bristol and West AC (est. 1882)",{"$f":"IF('[2]Longtown Llanthony Loop race pr'!$E41=\"Male\",\"M\",\"F\")","v":"M"},"SM",3.7916666666666665,102.5522041763341]
[41,null,"Luke Davies","Swansea Harriers",{"$f":"IF('[2]Longtown Llanthony Loop race pr'!$E42=\"Male\",\"M\",\"F\")","v":"M"},"SM",3.8062499999999999,102.1774049616277]
[42,null,"David Wood","Dursley Running Club",{"$f":"IF('[2]Longtown Llanthony Loop race pr'!$E43=\"Male\",\"M\",\"F\")","v":"M"},"MV50",3.8215277777777779,101.7847581652686]
[43,null,"Tony Wooldridge","Dursley Running Club",{"$f":"IF('[2]Longtown Llanthony Loop race pr'!$E44=\"Male\",\"M\",\"F\")","v":"M"},"MV65",3.8416666666666668,101.26717829734071]
[44,null,"Louise Barker","Aberystwyth AC",{"$f":"IF('[2]Longtown Llanthony Loop race pr'!$E45=\"Male\",\"M\",\"F\")","v":"F"},"FV40",3.9076388888888887,99.571658040335535]
[45,null,"Andrew Blackmore","Mynyddwyr de Cymru",{"$f":"IF('[2]Longtown Llanthony Loop race pr'!$E46=\"Male\",\"M\",\"F\")","v":"M"},"MV50",3.9375,98.804212029270033]
[46,null,"Richard Simpson",null,{"$f":"IF('[2]Longtown Llanthony Loop race pr'!$E47=\"Male\",\"M\",\"F\")","v":"M"},"MV40",3.9465277777777779,98.572193467785112]
[47,null,"Vanessa  Lawson","Chepstow Harriers",{"$f":"IF('[2]Longtown Llanthony Loop race pr'!$E48=\"Male\",\"M\",\"F\")","v":"F"},"FV40",3.9708333333333332,97.947528109941089]
[48,null,"gareth welch",null,{"$f":"IF('[2]Longtown Llanthony Loop race pr'!$E49=\"Male\",\"M\",\"F\")","v":"M"},"MV40",4.0145833333333334,96.823130465821876]
[49,null,"Andrew Wood",null,{"$f":"IF('[2]Longtown Llanthony Loop race pr'!$E50=\"Male\",\"M\",\"F\")","v":"M"},"SM",4.0159722222222225,96.787435302516499]
[50,null,"Duncan Loughrey",null,{"$f":"IF('[2]Longtown Llanthony Loop race pr'!$E51=\"Male\",\"M\",\"F\")","v":"M"},"MV50",4.0375000000000005,96.234160271283216]
[51,null,"Martin Chammings","Parc Bryn Bach",{"$f":"IF('[2]Longtown Llanthony Loop race pr'!$E52=\"Male\",\"M\",\"F\")","v":"M"},"SM",4.0548611111111112,95.787970729966077]
[52,null,"Martin Simmons",null,{"$f":"IF('[2]Longtown Llanthony Loop race pr'!$E53=\"Male\",\"M\",\"F\")","v":"M"},"MV50",4.0604166666666668,95.645190076744598]
[53,null,"Andy Stott","MDC",{"$f":"IF('[2]Longtown Llanthony Loop race pr'!$E54=\"Male\",\"M\",\"F\")","v":"M"},"MV50",4.0895833333333336,94.89559164733177]
[54,null,"Dave Farrow","Mercia Fell Runners",{"$f":"IF('[2]Longtown Llanthony Loop race pr'!$E55=\"Male\",\"M\",\"F\")","v":"M"},"MV50",4.1368055555555552,93.681956094949143]
[55,null,"Ben Watkins","Mynydd Du",{"$f":"IF('[2]Longtown Llanthony Loop race pr'!$E56=\"Male\",\"M\",\"F\")","v":"M"},"SM",4.1604166666666664,93.075138318757794]
[56,null,"James Griffiths","Newent Runners",{"$f":"IF('[2]Longtown Llanthony Loop race pr'!$E57=\"Male\",\"M\",\"F\")","v":"M"},"MV50",4.1680555555555552,92.87881492057825]
[57,null,"Rona Davies","Mynydd Du",{"$f":"IF('[2]Longtown Llanthony Loop race pr'!$E58=\"Male\",\"M\",\"F\")","v":"F"},"FV50",4.1826388888888895,92.504015705871836]
[58,null,"John Jaspers",null,{"$f":"IF('[2]Longtown Llanthony Loop race pr'!$E59=\"Male\",\"M\",\"F\")","v":"M"},"MV40",4.1909722222222223,92.289844726039604]
[59,null,"Celia  Mills",null,{"$f":"IF('[2]Longtown Llanthony Loop race pr'!$E60=\"Male\",\"M\",\"F\")","v":"F"},"MV60",4.2152777777777777,91.665179368195609]
[60,null,"Hugh  Morgan Jones","WFRA",{"$f":"IF('[2]Longtown Llanthony Loop race pr'!$E61=\"Male\",\"M\",\"F\")","v":"M"},"MV50",4.2159722222222227,91.647331786542892]
[61,null,"Emily Ford","MDC",{"$f":"IF('[2]Longtown Llanthony Loop race pr'!$E62=\"Male\",\"M\",\"F\")","v":"F"},"SF",4.2229166666666664,91.468855970016065]
[62,null,"alan stanley","n/a",{"$f":"IF('[2]Longtown Llanthony Loop race pr'!$E63=\"Male\",\"M\",\"F\")","v":"M"},"MV50",4.2486111111111109,90.808495448866694]
[63,null,"Jo Shelmerdine","Andover AC",{"$f":"IF('[2]Longtown Llanthony Loop race pr'!$E64=\"Male\",\"M\",\"F\")","v":"F"},"SF",4.2611111111111111,90.487238979118317]
[64,null,"Beverley Tucker","Mynydd Du",{"$f":"IF('[2]Longtown Llanthony Loop race pr'!$E65=\"Male\",\"M\",\"F\")","v":"F"},"FV50",4.3659722222222221,87.792254149562737]
[65,null,"Michael Marks","FODAC",{"$f":"IF('[2]Longtown Llanthony Loop race pr'!$E66=\"Male\",\"M\",\"F\")","v":"M"},"MV50",4.3812500000000005,87.399607353203621]
[66,null,"Jim Jones","Helsby Running Club",{"$f":"IF('[2]Longtown Llanthony Loop race pr'!$E67=\"Male\",\"M\",\"F\")","v":"M"},"MV50",4.4076388888888891,{"$f":"(2-(G67/L$10))*100","v":86.721399250401561}]
[67,null,"Andrew Chambers",null,{"$f":"IF('[2]Longtown Llanthony Loop race pr'!$E68=\"Male\",\"M\",\"F\")","v":"M"},"MV40",4.5284722222222227,83.615920042834176]
[68,null,"Gary Gunner","Croft Ambrey RC",{"$f":"IF('[2]Longtown Llanthony Loop race pr'!$E69=\"Male\",\"M\",\"F\")","v":"M"},"MV70",4.552777777777778,82.991254684990182]
[69,null,"Caroline Dallimore","MDC",{"$f":"IF('[2]Longtown Llanthony Loop race pr'!$E70=\"Male\",\"M\",\"F\")","v":"F"},"FV60",4.5618055555555559,82.759236123505246]
[70,null,"Tim Buckley","Chepstow Harriers",{"$f":"IF('[2]Longtown Llanthony Loop race pr'!$E71=\"Male\",\"M\",\"F\")","v":"M"},"MV50",4.614583333333333,81.402819917901127]
[71,null,"Paul Symons",null,{"$f":"IF('[2]Longtown Llanthony Loop race pr'!$E72=\"Male\",\"M\",\"F\")","v":"M"},"MV50",4.65625,80.331965018739965]
[72,null,"Les Williams","rhedwyr eryri",{"$f":"IF('[2]Longtown Llanthony Loop race pr'!$E73=\"Male\",\"M\",\"F\")","v":"M"},"MV70",4.7347222222222225,78.315188291986431]
[73,null,"Hamish Hughson","Chepstow Harriers",{"$f":"IF('[2]Longtown Llanthony Loop race pr'!$E74=\"Male\",\"M\",\"F\")","v":"M"},"MV40",4.7583333333333337,77.708370515795082]
[74,null,"Archie Gemell",null,{"$f":"IF('[2]Longtown Llanthony Loop race pr'!$E75=\"Male\",\"M\",\"F\")","v":"M"},"MV50",4.7895833333333337,76.905229341424231]
[75,null,"Janet Richards","Mynydd Du",{"$f":"IF('[2]Longtown Llanthony Loop race pr'!$E76=\"Male\",\"M\",\"F\")","v":"F"},"FV50",4.7972222222222225,76.708905943244687]
[76,null,"Flora Gunner","Croft Ambrey RC",{"$f":"IF('[2]Longtown Llanthony Loop race pr'!$E77=\"Male\",\"M\",\"F\")","v":"F"},"MV50",4.8187500000000005,76.155630912011404]
[77,null,"John Price","Hay Hotfooters",{"$f":"IF('[2]Longtown Llanthony Loop race pr'!$E78=\"Male\",\"M\",\"F\")","v":"M"},"MV60",4.8368055555555554,75.691593789041576]
[78,null,"Stefanie Francis","Forest of Dean AC",{"$f":"IF('[2]Longtown Llanthony Loop race pr'!$E79=\"Male\",\"M\",\"F\")","v":"F"},"MV50",4.8687499999999995,74.870605033018037]
[79,null,"Tom Davies","Croft Ambrey RC",{"$f":"IF('[2]Longtown Llanthony Loop race pr'!$E80=\"Male\",\"M\",\"F\")","v":"M"},"MV65",4.9847222222222225,71.890058897019443]
[80,null,"Charlotte Goodwin",null,{"$f":"IF('[2]Longtown Llanthony Loop race pr'!$E81=\"Male\",\"M\",\"F\")","v":"F"},"SM",4.9930555555555554,71.675887917187225]
[81,null,"William Darby","Mynydd Du",{"$f":"IF('[2]Longtown Llanthony Loop race pr'!$E82=\"Male\",\"M\",\"F\")","v":"M"},"MV60",5.291666666666667,64.001427806532192]
[82,null,"Chris Hawkins","Forest of Dean AC",{"$f":"IF('[2]Longtown Llanthony Loop race pr'!$E83=\"Male\",\"M\",\"F\")","v":"M"},"MV65",5.3930555555555557,61.395680885240033]
[83,null,"Liselette Adams","FODAC",{"$f":"IF('[2]Longtown Llanthony Loop race pr'!$E84=\"Male\",\"M\",\"F\")","v":"F"},"FV40",5.3930555555555557,61.395680885240033]
[85,null,"claire carden","none",{"$f":"IF('[2]Longtown Llanthony Loop race pr'!$E85=\"Male\",\"M\",\"F\")","v":"F"},"MV40",5.4402777777777773,60.182045332857406]
[86,null,"Matthew Knight","Hereford Couriers",{"$f":"IF('[2]Longtown Llanthony Loop race pr'!$E86=\"Male\",\"M\",\"F\")","v":"M"},"SM",5.573611111111112,56.755309655541652]
[87,null,"Paul Colley-Davies","Croft Ambrey RC",{"$f":"IF('[2]Longtown Llanthony Loop race pr'!$E87=\"Male\",\"M\",\"F\")","v":"M"},"MV50",5.5743055555555552,56.737462073888992]
[]
[]
[]
[]
[]
[]
[]
[]
[]
[]
[]
[]
[]
[]
[]
[]
[]
[]
[]
[]
[]
[]
[]
[]
[]
[]
[]
[]
[]
[]
[]
[]
[]
[]
[]
[]
[]
[]
[]
[]
[]
[]
[]
[]
[]
[]
[]
[]
[136,null,null,null,null,null,null,{"$f":"(2-(G136/L$10))*100","v":200}]

{"sheet":"Cwmdu","index":4,"n_rows":72,"n_cols":12,"rows_kept":72,"cut":false,"hidden":false,"merged":[]}
["Position","Number","Name","Club","Gender","Category","Time","Points"]
[1,null,"Sam Tosh","Rossendale H","M","SM","01:17:32",{"$f":"(2-(G2/L$10))*100","v":125.32665575138849}]
[2,null,"Pete Ryder","Aberdare","M","SM",5.6296296296296296E-2,{"$f":"(2-(G3/L$10))*100","v":121.92365726026517},null,"Number of runners","Position","Time (hr.min.sec)"]
[3,null,"Jack Agnew","Mercia","M","U23",6.0150462962962954E-2,116.57838132845357,null,71,{"$f":"K6+2","v":38},{"$f":"VLOOKUP(K4,A$2:G$201,7,FALSE)","v":"01:45:02"}]
[4,null,"Andy Stephens","Monross","M","M40",6.1238425925925932E-2,115.06950463899321,null,"Was it an even field?",{"$f":"K6+1","v":37},{"$f":"VLOOKUP(K5,A$2:G$201,7,FALSE)","v":"01:44:44"}]
[5,null,"Tom Turner","Mynydd Du","M","M",6.2511574074074081E-2,113.3037978747311,null,{"$f":"ISEVEN(J4)","v":false},{"$f":"IF(J6 = TRUE,(J4/2),((J4+1)/2))","v":36},"01:43:44"]
[6,null,"Wyndham Turner",null,"M","M",6.3113425925925934E-2,112.46910013162541,null,null,{"$f":"K6-1","v":35},"01:43:26"]
[7,null,"Mel Price","Mercia","F","F40",6.3252314814814817E-2,112.2764775755241,null,null,{"$f":"K6-2","v":34},{"$f":"VLOOKUP(K8,A$2:G$201,7,FALSE)","v":"01:42:13"}]
[8,null,"Dan Sandford","FOD","M","M40",6.3935185185185178E-2,111.32941667469262,null,null,null,{"$f":"VLOOKUP(K9,A7:G206,7,FALSE)","v":{"$error":"#N/A"}}]
[9,null,"Nigeal Rogerson",null,"M","M40",6.458333333333334E-2,110.43051141288642,null,null,null,{"$f":"IF(J6=TRUE,AVERAGE(L4:L9),AVERAGE(L4:L8))","v":"01:43:49.800"}]
[10,null,"Matt O'Keefe","MDC","M","M",6.4652777777777767E-2,110.3342001348358]
[11,null,"Helen Brown","Mynydd Du","F","F40",6.474537037037037E-2,110.2057850974349]
[12,null,"Ian Luke","Poole R","M","M",6.4791666666666664E-2,110.14157757873448]
[13,null,"Dan Lewis","Wye V","M","M40",6.5601851851851856E-2,109.01794600147676]
[14,null,"Michael Reynolds","Mercia","M","M50",6.5763888888888886E-2,108.79321968602524]
[15,null,"John Aggleton","MDC","M","M60",6.6724537037037027E-2,107.46091367299111]
[16,null,"Steve 'Amazing' Hepton…","Mynydd Du","M","M40",6.7048611111111114E-2,107.01146104208803]
[17,null,"Helen Marshall","Aberystwyth","F","F",6.7245370370370358E-2,106.73857908761117]
[18,null,"Niki Radnege",null,"M","M40",6.7291666666666666E-2,106.67437156891073]
[19,null,"Mark Agnew","Mercia","M","M50",6.7731481481481476E-2,106.06440014125656]
[20,null,"Andy Horlick","FOD","M","M40",6.7835648148148145E-2,105.91993322418057]
[21,null,"Andy Vaudin",null,"M","M50",6.8009259259259255E-2,105.6791550290539]
[22,null,"Robin Bacon","Mercia","M","M50",6.822916666666666E-2,105.37416931522681]
[23,null,"Paul Tucker","Mynydd Du","M","M50",6.8333333333333343E-2,105.22970239815082]
[24,null,"Alexander Eynon",null,"M","M50",6.8472222222222226E-2,105.03707984204951]
[25,null,"James Bellin",null,"M","M",6.8784722222222219E-2,104.60367909082153]
[26,null,"Andrew Brasington","Ebbw Vale","M","M50",6.9629629629629625E-2,103.43189187453849]
[27,null,"Andrew Pritchard","Buckley Runners","M","M40",6.9814814814814816E-2,103.17506179973674]
[28,null,"Sanjai Sharma","Bounemouth","M","M50",6.9884259259259271E-2,103.07875052168608]
[29,null,"Phil Richards","Weston","F","F40",7.0057870370370381E-2,102.83797232655942]
[30,null,"David Mullin","Mercia","M","M40",7.0497685185185191E-2,102.22800089890525]
[31,null,"Kevin Hagley","SWRR","M","M50",7.0520833333333324E-2,102.19589713955503]
[32,null,"Peter Sowerby","Brecon","M","M50",7.0868055555555545E-2,101.71434074930174]
[33,null,"Rhian Probert","Mynydd Du","F","F40",7.0949074074074081E-2,101.60197759157596]
[34,null,"Sam Weale","Monross","M","M",7.0983796296296295E-2,101.55382195255065]
[35,null,"Kenneth Cox","Southville","M","M",7.1828703703703714E-2,100.38203473626761]
[36,null,"Nick Biggs",null,"M","M40",7.2037037037037038E-2,100.09310090211562]
[37,null,"Gareth Bryer","Mynydd Du","M","M40",7.273148148148148E-2,99.129988121609045]
[38,null,"Sammi Toop","Mynydd Du","F","F",7.2939814814814805E-2,98.841054287457069]
[39,null,"James Gale","Southville","M","M",7.300925925925926E-2,98.744743009406392]
[40,null,"Richard Cronin","MDC","M","M",7.3263888888888892E-2,98.391601656553988]
[41,null,"Matthew Haynes","Hay Hotfooters","M","M40",7.33449074074074E-2,98.279238498828221]
[42,null,"Matthew Lawson","Chepstw","M","M40",7.346064814814815E-2,98.118719702077101]
[43,null,"Sasha Habgood","Mynydd Du","F","F40",7.3483796296296297E-2,98.086615942726894]
[44,null,"Tom Morfey","Cardiff Harlequins","M","U23",7.3657407407407408E-2,97.845837747600257]
[45,null,"James Woodier","Mynydd Du","M","M",7.4826388888888887E-2,96.224597900414139]
[46,null,"Martin Simmons",null,"M","M50",7.5115740740740747E-2,95.823300908536368]
[47,null,"Debbie Stenner","FOD","F","F40",7.6180555555555557E-2,94.346527978426266]
["48=",null,"Hannah Hopkinson",null,"F","F",7.6574074074074072E-2,93.800764069472535]
["48=",null,"Matthew Marshall","Southville","M","M",7.6574074074074072E-2,93.800764069472535]
[50,null,"Emily Cox","Southville","F","F",7.379629629629629E-2,97.653215191498916]
[51,null,"Andy Blackmore","MDC","M","M50",7.7488425925925919E-2,92.532665575138864]
[52,null,"Naomi Law","Mynydd Du","F","F40",7.8993055555555552E-2,90.445921217374561]
[53,null,"Gareth Welch",null,"M","M40",7.9872685185185185E-2,89.225978362066186]
[54,null,"John Jaspers",null,"M","M40",8.0451388888888878E-2,88.423384378310715]
[55,null,"Mike Harris","Westbury","M","M60",8.1493055555555555E-2,86.978715207550806]
[56,null,"Richard Simpson",null,"M","M40",8.1979166666666672E-2,86.304536261196162]
[57,null,"Kate O'Sullivan","Aberystwyth","F","F50",8.2037037037037033E-2,86.224276862820631]
[58,null,"Steve Harrhy","Pont y Pwl","M","M50",8.2106481481481489E-2,86.127965584769967]
[59,null,"Andy Stott","MDC","M","M50",8.2592592592592592E-2,85.453786638415366]
[60,null,"Bev Tucker","Mynydd Du","F","F50",8.3703703703703711E-2,83.912806189604794]
[61,null,"Christine Farr","MDC","F","F40",8.3761574074074072E-2,83.832546791229248]
[62,null,"Hugh Morgan-Jones","WFRA","M","M50",8.3865740740740727E-2,83.688079874153274]
[63,null,"Simon Dancel","Bristol Up & Runners","M","M40",8.4085648148148132E-2,83.383094160326181]
[64,null,"Rona Davies","Mynydd Du","F","F50",8.5717592592592595E-2,81.119779126135654]
[65,null,"Pete Morfey","Cardiff Harlequins","M","M60",8.5960648148148147E-2,80.782689652958368]
[66,null,"Gareth Jones","MDC","M","M70",8.7488425925925928E-2,{"$f":"(2-(G67/L$10))*100","v":78.663841535843844}]
[67,null,"Caroline Dallimore","MDC","F","F60",8.9409722222222224E-2,75.999229509775574]
[68,null,"Jonathan Humphries",null,"M","M",9.2592592592592601E-2,71.584962599120345]
[69,null,"Karen Elvers","MDC","F","F40",9.4398148148148162E-2,69.080869369803182]
[70,null,"Gary Gunner","Croft Ambrey","M","M70",9.8749999999999991E-2,63.045362611961878]
[71,null,"Les Williams","Eryri","M","M70",9.9513888888888888E-2,61.985938553404594]

{"sheet":"Middletown Show","index":5,"n_rows":97,"n_cols":12,"rows_kept":97,"cut":false,"hidden":false,"merged":[]}
["Position","Number","Name","Club","Gender","Category","Time","Points"]
[1]
[{"$f":"A2+1","v":2},null,null,null,null,null,null,null,null,"Number of runners","Position","Time (min.sec)"]
[{"$f":"A3+1","v":3},null,null,null,null,null,null,null,null,{"$f":"COUNT(A2:A201)","v":96},{"$f":"K6+2","v":50},{"$f":"VLOOKUP(K4,A2:G201,7,FALSE)","v":"00:00:00"}]
[4,null,null,null,null,null,null,null,null,{"$f":"ISEVEN(J4)","v":true},{"$f":"K6+1","v":49},{"$f":"VLOOKUP(K5,A3:G202,7,FALSE)","v":"00:00:00"}]
[5,null,null,null,null,null,null,null,null,null,{"$f":"IF(J5 = TRUE,(J4/2),((J4+1)/2))","v":48},"00:00:00"]
[6,null,null,null,null,null,null,null,null,null,{"$f":"K6-1","v":47},"00:00:00"]
[7,null,null,null,null,null,null,null,null,null,{"$f":"K6-2","v":46},"00:00:00"]
[8,null,null,null,null,null,null,null,null,null,{"$f":"IF(J5 = TRUE, K6-3, Na)","v":45},"00:00:00"]
[9,null,null,null,null,null,null,null,null,null,null,{"$f":"IF(J5=TRUE,AVERAGE(L4:L9),AVERAGE(L4:L8))","v":"00:00:00"}]
[10]
[11]
[12]
[13]
[14]
[15]
[16]
[17]
[18]
[19]
[20]
[21]
[22]
[23]
[24]
[25]
[26]
[27]
[28]
[29]
[30]
[31]
[32]
[33]
[34]
[35]
[36]
[37]
[38]
[39]
[40]
[41]
[42]
[43]
[44]
[45]
[46]
[47]
[48]
[49]
[50]
[51]
[52]
[53]
[54]
[55]
[56]
[57]
[58]
[59]
[60]
[61]
[62]
[63]
[64]
[65]
[66]
[{"$f":"A67+1","v":67}]
[68]
[69]
[70]
[71]
[72]
[73]
[74]
[75]
[76]
[77]
[78]
[79]
[80]
[81]
[82]
[83]
[84]
[85]
[86]
[87]
[88]
[89]
[90]
[91]
[92]
[93]
[94]
[95]
[96]

{"sheet":"Guto Nyth Bran","index":6,"n_rows":39,"n_cols":12,"rows_kept":39,"cut":false,"hidden":false,"merged":[]}
["Position","Number","Name","Club","Gender","Category","Time","Points"]
[1]
[{"$f":"A2+1","v":2},null,null,null,null,null,null,null,null,"Number of runners","Position","Time (min.sec)"]
[{"$f":"A3+1","v":3},null,null,null,null,null,null,null,null,{"$f":"COUNT(A2:A201)","v":38},{"$f":"K6+2","v":21},{"$f":"VLOOKUP(K4,A2:G201,7,FALSE)","v":"00:00:00"}]
[4,null,null,null,null,null,null,null,null,{"$f":"ISEVEN(J4)","v":true},{"$f":"K6+1","v":20},"00:00:00"]
[5,null,null,null,null,null,null,null,null,null,{"$f":"IF(J5 = TRUE,(J4/2),((J4+1)/2))","v":19},"00:00:00"]
[6,null,null,null,null,null,null,null,null,null,{"$f":"K6-1","v":18},"00:00:00"]
[7,null,null,null,null,null,null,null,null,null,{"$f":"K6-2","v":17},"00:00:00"]
[8,null,null,null,null,null,null,null,null,null,{"$f":"IF(J5 = TRUE, K6-3, Na)","v":16},"00:00:00"]
[9,null,null,null,null,null,null,null,null,null,null,{"$f":"IF(J5=TRUE,AVERAGE(L4:L9),AVERAGE(L4:L8))","v":"00:00:00"}]
[10]
[11]
[12]
[13]
[14]
[15]
[16]
[17]
[18]
[19]
[20]
[21]
[22]
[23]
[24]
[25]
[26]
[27]
[28]
[29]
[30]
[31]
[32]
[33]
[34]
[35]
[36]
[37]
[38]

{"sheet":"Brecon Beacons","index":7,"n_rows":40,"n_cols":12,"rows_kept":40,"cut":false,"hidden":false,"merged":[]}
["Position","Number","Name","Club","Sex","Category","Time","Points"]
[1]
[2,null,null,null,null,null,null,null,null,"Number of runners","Position","Time (min.sec)"]
[3,null,null,null,null,null,null,null,null,{"$f":"COUNT(A2:A201)","v":39},{"$f":"K6+2","v":22},{"$f":"VLOOKUP(K4,A2:G201,7,FALSE)","v":0}]
[4,null,null,null,null,null,null,null,null,{"$f":"ISEVEN(J4)","v":false},{"$f":"K6+1","v":21},{"$f":"VLOOKUP(K5,A2:G202,7,FALSE)","v":0}]
[5,null,null,null,null,null,null,null,null,null,{"$f":"IF(J5 = TRUE,(J4/2),((J4+1)/2))","v":20},{"$f":"VLOOKUP(K6,A3:G203,7,FALSE)","v":0}]
[6,null,null,null,null,null,null,null,null,null,{"$f":"K6-1","v":19},{"$f":"VLOOKUP(K7,A4:G204,7,FALSE)","v":0}]
[7,null,null,null,null,null,null,null,null,null,{"$f":"K6-2","v":18},{"$f":"VLOOKUP(K8,A5:G205,7,FALSE)","v":0}]
[8,null,null,null,null,null,null,null,null,null,{"$f":"IF(J5 = TRUE, K6-3, Na)","v":{"$error":"#NAME?"}},{"$f":"VLOOKUP(K9,A6:G206,7,FALSE)","v":{"$error":"#NAME?"}}]
[9,null,null,null,null,null,null,null,null,null,null,{"$f":"IF(J5=TRUE,AVERAGE(L4:L9),AVERAGE(L4:L8))","v":0}]
[10]
[11]
[12]
[13]
[14]
[15]
[16]
[17]
[18]
[19]
[20]
[21]
[22]
[23]
[24]
[25]
[26]
[27]
[28]
[29]
[30]
[31]
[32]
[33]
[34]
[35]
[36]
[37]
[38]
[39]

{"sheet":"Fan Fawr","index":8,"n_rows":0,"n_cols":0,"rows_kept":0,"cut":false,"hidden":false,"merged":[]}

{"sheet":"WFRA Membership March 2017","index":9,"n_rows":413,"n_cols":11,"rows_kept":413,"cut":false,"hidden":false,"merged":[]}
[]
[null,null,"1st","2nd","middle name removed","Spaces Trimed","Spaces Trimed",null,null,"Hopefully this is the name used at races…"]
[null,null,"Ross","Roberts",{"$f":"IF(ISERROR(FIND(\" \",C3)),C3,MID(C3,1,FIND(\" \",C3)))","v":"Ross"},{"$f":"TRIM(E3)","v":"Ross"},{"$f":"TRIM(D3)","v":"Roberts"},null,null,{"$f":"_xlfn.CONCAT(F3,\" \",G3)","v":"Ross Roberts"},{"$f":"J3","v":"Ross Roberts"}]
[null,null,"Tony","Wood",{"$f":"IF(ISERROR(FIND(\" \",C4)),C4,MID(C4,1,FIND(\" \",C4)))","v":"Tony"},{"$f":"TRIM(E4)","v":"Tony"},{"$f":"TRIM(D4)","v":"Wood"},null,null,{"$f":"_xlfn.CONCAT(F4,\" \",G4)","v":"Tony Wood"},{"$f":"J4","v":"Tony Wood"}]
[null,null,"Sue","Buck","Sue","Sue","Buck",null,null,"Sue Buck","Sue Buck"]
[null,null,"Emma","Collins","Emma","Emma","Collins",null,null,"Emma Collins","Emma Collins"]
[null,null,"Adrian","Moir","Adrian","Adrian","Moir",null,null,{"$f":"_xlfn.CONCAT(F7,\" \",G7)","v":"Adrian Moir"},"Adrian Moir"]
[null,null,"Martin","Cable","Martin","Martin","Cable",null,null,"Martin Cable","Martin Cable"]
[null,null,"Dave","Farrow","Dave","Dave","Farrow",null,null,"Dave Farrow","Dave Farrow"]
[null,null,"John","Rowley","John","John","Rowley",null,null,"John Rowley","John Rowley"]
[null,null,"Miranda","Grant","Miranda","Miranda","Grant",null,null,"Miranda Grant","Miranda Grant"]
[null,null,"Aled","Edwards","Aled","Aled","Edwards",null,null,"Aled Edwards","Aled Edwards"]
[null,null,"Richard","Self","Richard","Richard","Self",null,null,"Richard Self","Richard Self"]
[null,null,"Craig","Edwards","Craig","Craig","Edwards",null,null,"Craig Edwards","Craig Edwards"]
[null,null,"Richard","Applewhite","Richard","Richard","Applewhite",null,null,"Richard Applewhite","Richard Applewhite"]
[null,null,"Simon","Adney","Simon","Simon","Adney",null,null,"Simon Adney","Simon Adney"]
[null,null,"John","Aggleton","John","John","Aggleton",null,null,"John Aggleton","John Aggleton"]
[null,null,"Hugh","Aggleton","Hugh","Hugh","Aggleton",null,null,"Hugh Aggleton","Hugh Aggleton"]
[null,null,"Paul","Aird","Paul","Paul","Aird",null,null,"Paul Aird","Paul Aird"]
[null,null,"Dave","Andrews","Dave","Dave","Andrews",null,null,"Dave Andrews","Dave Andrews"]
[null,null,"Robert","Armstrong","Robert","Robert","Armstrong",null,null,"Robert Armstrong","Robert Armstrong"]
[null,null,"Neil","Ashcroft","Neil","Neil","Ashcroft",null,null,"Neil Ashcroft","Neil Ashcroft"]
[null,null,"Charles","Ashley","Charles","Charles","Ashley",null,null,"Charles Ashley","Charles Ashley"]
[null,null,"Mark","Atherton","Mark","Mark","Atherton",null,null,"Mark Atherton","Mark Atherton"]
[null,null,"Dave","Austin","Dave","Dave","Austin",null,null,"Dave Austin","Dave Austin"]
[null,null,"Ainsley","Baker","Ainsley","Ainsley","Baker",null,null,"Ainsley Baker","Ainsley Baker"]
[null,null,"Louise","Barker","Louise","Louise","Barker",null,null,"Louise Barker","Louise Barker"]
[null,null,"Charlotte","Barlow","Charlotte","Charlotte","Barlow",null,null,"Charlotte Barlow","Charlotte Barlow"]
[null,null,"Anna","Bartlett","Anna","Anna","Bartlett",null,null,"Anna Bartlett","Anna Bartlett"]
[null,null,"Sharon","Basford","Sharon","Sharon","Basford",null,null,"Sharon Basford","Sharon Basford"]
[null,null,"John","Battersby","John","John","Battersby",null,null,"John Battersby","John Battersby"]
[null,null,"David","Baugh","David","David","Baugh",null,null,"David Baugh","David Baugh"]
[null,null,"Menai","Baugh","Menai","Menai","Baugh",null,null,"Menai Baugh","Menai Baugh"]
[null,null,"Emma","McWilliams","Emma","Emma","McWilliams",null,null,"Emma McWilliams","Emma McWilliams"]
[null,null,"Chris","Baynham-Hughes","Chris","Chris","Baynham-Hughes",null,null,"Chris Baynham-Hughes","Chris Baynham-Hughes"]
[null,null,"Kate","Beecher","Kate","Kate","Beecher",null,null,"Kate Beecher","Kate Beecher"]
[null,null,"Paul","Beeson","Paul","Paul","Beeson",null,null,"Paul Beeson","Paul Beeson"]
[null,null,"Louise","Beetlestone","Louise","Louise","Beetlestone",null,null,"Louise Beetlestone","Louise Beetlestone"]
[null,null,"Victor","Belshaw","Victor","Victor","Belshaw",null,null,"Victor Belshaw","Victor Belshaw"]
[null,null,"Tony ","Benton","Tony ","Tony","Benton",null,null,"Tony Benton","Tony Benton"]
[null,null,"Hazel","Berrett","Hazel","Hazel","Berrett",null,null,"Hazel Berrett","Hazel Berrett"]
[null,null,"Joe","Beswick","Joe","Joe","Beswick",null,null,"Joe Beswick","Joe Beswick"]
[null,null,"David","Bevan","David","David","Bevan",null,null,"David Bevan","David Bevan"]
[null,null,"Wayne","Billman","Wayne","Wayne","Billman",null,null,"Wayne Billman","Wayne Billman"]
[null,null,"Joe","Blackett","Joe","Joe","Blackett",null,null,"Joe Blackett","Joe Blackett"]
[null,null,"Andrew","Blackmore","Andrew","Andrew","Blackmore",null,null,"Andrew Blackmore","Andrew Blackmore"]
[null,null,"Simon","Blease","Simon","Simon","Blease",null,null,"Simon Blease","Simon Blease"]
[null,null,"Richard","Borne","Richard","Richard","Borne",null,null,"Richard Borne","Richard Borne"]
[null,null,"Nicholas","Bradley","Nicholas","Nicholas","Bradley",null,null,"Nicholas Bradley","Nicholas Bradley"]
[null,null,"Carl","Brancher","Carl","Carl","Brancher",null,null,"Carl Brancher","Carl Brancher"]
[null,null,"Jez","Brown","Jez","Jez","Brown",null,null,"Jez Brown","Jez Brown"]
[null,null,"Helen","Brown","Helen","Helen","Brown",null,null,"Helen Brown","Helen Brown"]
[null,null,"Peter","Browning","Peter","Peter","Browning",null,null,"Peter Browning","Peter Browning"]
[null,null,"Gareth","Buffett","Gareth","Gareth","Buffett",null,null,"Gareth Buffett","Gareth Buffett"]
[null,null,"John","Carson","John","John","Carson",null,null,"John Carson","John Carson"]
[null,null,"Michael","Catling","Michael","Michael","Catling",null,null,"Michael Catling","Michael Catling"]
[null,null,"Chris","Chambers","Chris","Chris","Chambers",null,null,"Chris Chambers","Chris Chambers"]
[null,null,"Paul","Chester","Paul","Paul","Chester",null,null,"Paul Chester","Paul Chester"]
[null,null,"Bob","Chiltern","Bob","Bob","Chiltern",null,null,"Bob Chiltern","Bob Chiltern"]
[null,null,"Geoff","Clegg","Geoff","Geoff","Clegg",null,null,"Geoff Clegg","Geoff Clegg"]
[null,null,"Martin","Cliffe","Martin","Martin","Cliffe",null,null,"Martin Cliffe","Martin Cliffe"]
[null,null,"Terry","Coleman","Terry","Terry","Coleman",null,null,"Terry Coleman","Terry Coleman"]
[null,null,"Graham","Colvin","Graham","Graham","Colvin",null,null,"Graham Colvin","Graham Colvin"]
[null,null,"Neil","Coppack","Neil","Neil","Coppack",null,null,"Neil Coppack","Neil Coppack"]
[null,null,"Michael","Corrales","Michael","Michael","Corrales",null,null,"Michael Corrales","Michael Corrales"]
[null,null,"John","Currie","John","John","Currie",null,null,"John Currie","John Currie"]
[null,null,"Caroline","Dallimore","Caroline","Caroline","Dallimore",null,null,"Caroline Dallimore","Caroline Dallimore"]
[null,null,"William","Darby",{"$f":"IF(ISERROR(FIND(\" \",C68)),C68,MID(C68,1,FIND(\" \",C68)))","v":"William"},{"$f":"TRIM(E68)","v":"William"},{"$f":"TRIM(D68)","v":"Darby"},null,null,{"$f":"_xlfn.CONCAT(F68,\" \",G68)","v":"William Darby"},{"$f":"J68","v":"William Darby"}]
[null,null,"Malcolm","Davies","Malcolm","Malcolm","Davies",null,null,"Malcolm Davies","Malcolm Davies"]
[null,null,"Neil","Davies","Neil","Neil","Davies",null,null,"Neil Davies","Neil Davies"]
[null,null,"Nicola","Davies","Nicola","Nicola","Davies",null,null,"Nicola Davies","Nicola Davies"]
[null,null,"Barry","Davies","Barry","Barry","Davies",null,null,"Barry Davies","Barry Davies"]
[null,null,"Tom","Davies","Tom","Tom","Davies",null,null,"Tom Davies","Tom Davies"]
[null,null,"Mark ","Davies","Mark ","Mark","Davies",null,null,"Mark Davies","Mark Davies"]
[null,null,"Emyr","Davies","Emyr","Emyr","Davies",null,null,"Emyr Davies","Emyr Davies"]
[null,null,"Eric","Davies","Eric","Eric","Davies",null,null,"Eric Davies","Eric Davies"]
[null,null,"Caryl","Davies","Caryl","Caryl","Davies",null,null,"Caryl Davies","Caryl Davies"]
[null,null,"Gary","Davies","Gary","Gary","Davies",null,null,"Gary Davies","Gary Davies"]
[null,null,"Ceri","Davies","Ceri","Ceri","Davies",null,null,"Ceri Davies","Ceri Davies"]
[null,null,"Rona","Davies","Rona","Rona","Davies",null,null,"Rona Davies","Rona Davies"]
[null,null,"Terry","Davies","Terry","Terry","Davies",null,null,"Terry Davies","Terry Davies"]
[null,null,"Tim","Davies","Tim","Tim","Davies",null,null,"Tim Davies","Tim Davies"]
[null,null,"Edward","Davies","Edward","Edward","Davies",null,null,"Edward Davies","Edward Davies"]
[null,null,"Carwyn","Davies","Carwyn","Carwyn","Davies",null,null,"Carwyn Davies","Carwyn Davies"]
[null,null,"Huw","Davies","Huw","Huw","Davies",null,null,"Huw Davies","Huw Davies"]
[null,null,"Jim","Davis","Jim","Jim","Davis",null,null,"Jim Davis","Jim Davis"]
[null,null,"Elizabeth","Davy","Elizabeth","Elizabeth","Davy",null,null,"Elizabeth Davy","Elizabeth Davy"]
[null,null,"Andrew ","Dickens","Andrew ","Andrew","Dickens",null,null,"Andrew Dickens","Andrew Dickens"]
[null,null,"Paul","Dodd","Paul","Paul","Dodd",null,null,"Paul Dodd","Paul Dodd"]
[null,null,"Joyce","Dodd","Joyce","Joyce","Dodd",null,null,"Joyce Dodd","Joyce Dodd"]
[null,null,"Dan","Doherty","Dan","Dan","Doherty",null,null,"Dan Doherty","Dan Doherty"]
[null,null,"Alan","Duncan","Alan","Alan","Duncan",null,null,"Alan Duncan","Alan Duncan"]
[null,null,"Peter","Eardley","Peter","Peter","Eardley",null,null,"Peter Eardley","Peter Eardley"]
[null,null,"Linda","Edmondson","Linda","Linda","Edmondson",null,null,"Linda Edmondson","Linda Edmondson"]
[null,null,"Juliet","Edwards","Juliet","Juliet","Edwards",null,null,"Juliet Edwards","Juliet Edwards"]
[null,null,"Adrian","Eggleton","Adrian","Adrian","Eggleton",null,null,"Adrian Eggleton","Adrian Eggleton"]
[null,null,"Duncan","Elliott","Duncan","Duncan","Elliott",null,null,"Duncan Elliott","Duncan Elliott"]
[null,null,"Karen","Elvers","Karen","Karen","Elvers",null,null,"Karen Elvers","Karen Elvers"]
[null,null,"Louise","Emery","Louise","Louise","Emery",null,null,"Louise Emery","Louise Emery"]
[null,null,"Mark","English","Mark","Mark","English",null,null,"Mark English","Mark English"]
[null,null,"Catherine","Etchell","Catherine","Catherine","Etchell",null,null,"Catherine Etchell","Catherine Etchell"]
[null,null,"Maldwyn","Evans","Maldwyn","Maldwyn","Evans",null,null,"Maldwyn Evans","Maldwyn Evans"]
[null,null,"Brian","Evans","Brian","Brian","Evans",null,null,"Brian Evans","Brian Evans"]
[null,null,"Rhodri","Evans","Rhodri","Rhodri","Evans",null,null,"Rhodri Evans","Rhodri Evans"]
[null,null,"Hayley","Evans","Hayley","Hayley","Evans",null,null,"Hayley Evans","Hayley Evans"]
[null,null,"Brian","Faulkner","Brian","Brian","Faulkner",null,null,"Brian Faulkner","Brian Faulkner"]
[null,null,"Mike","Fawcett","Mike","Mike","Fawcett",null,null,"Mike Fawcett","Mike Fawcett"]
[null,null,"Jeremy","Fellick","Jeremy","Jeremy","Fellick",null,null,"Jeremy Fellick","Jeremy Fellick"]
[null,null,"Geoffrey","Fielding","Geoffrey","Geoffrey","Fielding",null,null,"Geoffrey Fielding","Geoffrey Fielding"]
[null,null,"Dick","Finch","Dick","Dick","Finch",null,null,"Dick Finch","Dick Finch"]
[null,null,"Gavin","Fisher","Gavin","Gavin","Fisher",null,null,"Gavin Fisher","Gavin Fisher"]
[null,null,"Glyn","Fletcher","Glyn","Glyn","Fletcher",null,null,"Glyn Fletcher","Glyn Fletcher"]
[null,null,"Alexandra","Fletcher","Alexandra","Alexandra","Fletcher",null,null,"Alexandra Fletcher","Alexandra Fletcher"]
[null,null,"Mario","Foschi","Mario","Mario","Foschi",null,null,"Mario Foschi","Mario Foschi"]
[null,null,"Paul","Fosh","Paul","Paul","Fosh",null,null,"Paul Fosh","Paul Fosh"]
[null,null,"Alan","French","Alan","Alan","French",null,null,"Alan French","Alan French"]
[null,null,"Peter","Gardner","Peter","Peter","Gardner",null,null,"Peter Gardner","Peter Gardner"]
[null,null,"Tom","Garrod","Tom","Tom","Garrod",null,null,"Tom Garrod","Tom Garrod"]
[null,null,"Ben","Gibbison","Ben","Ben","Gibbison",null,null,"Ben Gibbison","Ben Gibbison"]
[null,null,"Christopher","Gildersleve","Christopher","Christopher","Gildersleve",null,null,"Christopher Gildersleve","Christopher Gildersleve"]
[null,null,"Phil ","Gillard","Phil ","Phil","Gillard",null,null,"Phil Gillard","Phil Gillard"]
[null,null,"Mary","Gillie","Mary","Mary","Gillie",null,null,"Mary Gillie","Mary Gillie"]
[null,null,"Bridget","Glaister","Bridget","Bridget","Glaister",null,null,"Bridget Glaister","Bridget Glaister"]
[null,null,"Neil","Grant","Neil","Neil","Grant",null,null,"Neil Grant","Neil Grant"]
[null,null,"Martin","Green","Martin","Martin","Green",null,null,"Martin Green","Martin Green"]
[null,null,"Sally","Greenwood","Sally","Sally","Greenwood",null,null,"Sally Greenwood","Sally Greenwood"]
[null,null,"Samuel","Gregory","Samuel","Samuel","Gregory",null,null,"Samuel Gregory","Samuel Gregory"]
[null,null,"Wynn","Griffith","Wynn","Wynn","Griffith",null,null,"Wynn Griffith","Wynn Griffith"]
[null,null,"Dylan","Griffiths","Dylan","Dylan","Griffiths",null,null,"Dylan Griffiths","Dylan Griffiths"]
[null,null,"Gary","Gunner","Gary","Gary","Gunner",null,null,"Gary Gunner","Gary Gunner"]
[null,null,"Adrian","Gwillam","Adrian","Adrian","Gwillam",null,null,"Adrian Gwillam","Adrian Gwillam"]
[null,null,"Sasha","Habgood",{"$f":"IF(ISERROR(FIND(\" \",C132)),C132,MID(C132,1,FIND(\" \",C132)))","v":"Sasha"},{"$f":"TRIM(E132)","v":"Sasha"},{"$f":"TRIM(D132)","v":"Habgood"},null,null,{"$f":"_xlfn.CONCAT(F132,\" \",G132)","v":"Sasha Habgood"},{"$f":"J132","v":"Sasha Habgood"}]
[null,null,"Tony","Hall","Tony","Tony","Hall",null,null,"Tony Hall","Tony Hall"]
[null,null,"Brian","Hardcastle","Brian","Brian","Hardcastle",null,null,"Brian Hardcastle","Brian Hardcastle"]
[null,null,"Jonathan","Hardman","Jonathan","Jonathan","Hardman",null,null,"Jonathan Hardman","Jonathan Hardman"]
[null,null,"Tim","Hargreaves","Tim","Tim","Hargreaves",null,null,"Tim Hargreaves","Tim Hargreaves"]
[null,null,"Mike","Harris","Mike","Mike","Harris",null,null,"Mike Harris","Mike Harris"]
[null,null,"Tom","Harrison","Tom","Tom","Harrison",null,null,"Tom Harrison","Tom Harrison"]
[null,null,"John","Heppenstall","John","John","Heppenstall",null,null,"John Heppenstall","John Heppenstall"]
[null,null,"Steve","Herington","Steve","Steve","Herington",null,null,"Steve Herington","Steve Herington"]
[null,null,"Simon","Hide","Simon","Simon","Hide",null,null,"Simon Hide","Simon Hide"]
[null,null,"Chris","Higgins","Chris","Chris","Higgins",null,null,"Chris Higgins","Chris Higgins"]
[null,null,"Fenella","Higgins","Fenella","Fenella","Higgins",null,null,"Fenella Higgins","Fenella Higgins"]
[null,null,"Dave","Hill","Dave","Dave","Hill",null,null,"Dave Hill","Dave Hill"]
[null,null,"Neil","Hindle","Neil","Neil","Hindle",null,null,"Neil Hindle","Neil Hindle"]
[null,null,"Mike","Hobday","Mike","Mike","Hobday",null,null,"Mike Hobday","Mike Hobday"]
[null,null,"Neal","Hockley","Neal","Neal","Hockley",null,null,"Neal Hockley","Neal Hockley"]
[null,null,"Paul","Hodges","Paul","Paul","Hodges",null,null,"Paul Hodges","Paul Hodges"]
[null,null,"Allan","Hodkinson","Allan","Allan","Hodkinson",null,null,"Allan Hodkinson","Allan Hodkinson"]
[null,null,"Chris","Holloway","Chris","Chris","Holloway",null,null,"Chris Holloway","Chris Holloway"]
[null,null,"Nicholas","Holmes","Nicholas","Nicholas","Holmes",null,null,"Nicholas Holmes","Nicholas Holmes"]
[null,null,"Kate","Hovers","Kate","Kate","Hovers",null,null,"Kate Hovers","Kate Hovers"]
[null,null,"Richard","Hudson","Richard","Richard","Hudson",null,null,"Richard Hudson","Richard Hudson"]
[null,null,"Andrew","Hughes","Andrew","Andrew","Hughes",null,null,"Andrew Hughes","Andrew Hughes"]
[null,null,"Goronwy","Hughes","Goronwy","Goronwy","Hughes",null,null,"Goronwy Hughes","Goronwy Hughes"]
[null,null,"Arfon","Hughes","Arfon","Arfon","Hughes",null,null,"Arfon Hughes","Arfon Hughes"]
[null,null,"Andrew","Hughes","Andrew","Andrew","Hughes",null,null,"Andrew Hughes","Andrew Hughes"]
[null,null,"Dan","Hurst","Dan","Dan","Hurst",null,null,"Dan Hurst","Dan Hurst"]
[null,null,"Gareth","Jaggard","Gareth","Gareth","Jaggard",null,null,"Gareth Jaggard","Gareth Jaggard"]
[null,null,"Stephen ","Jeffery","Stephen ","Stephen","Jeffery",null,null,"Stephen Jeffery","Stephen Jeffery"]
[null,null,"Paul","Jeggo","Paul","Paul","Jeggo",null,null,"Paul Jeggo","Paul Jeggo"]
[null,null,"Jeremy ","Jehan","Jeremy ","Jeremy","Jehan",null,null,"Jeremy Jehan","Jeremy Jehan"]
[null,null,"David","Jenkins","David","David","Jenkins",null,null,"David Jenkins","David Jenkins"]
[null,null,"Andrew ","Johnson","Andrew ","Andrew","Johnson",null,null,"Andrew Johnson","Andrew Johnson"]
[null,null,"Richard ","Johnson","Richard ","Richard","Johnson",null,null,"Richard Johnson","Richard Johnson"]
[null,null,"David  ","Johnston","David ","David","Johnston",null,null,"David Johnston","David Johnston"]
[null,null,"Hugh ","Jones","Hugh ","Hugh","Jones",null,null,"Hugh Jones","Hugh Jones"]
[null,null,"Richard","Jones","Richard","Richard","Jones",null,null,"Richard Jones","Richard Jones"]
[null,null,"Alan","Jones","Alan","Alan","Jones",null,null,"Alan Jones","Alan Jones"]
[null,null,"Craig","Jones","Craig","Craig","Jones",null,null,"Craig Jones","Craig Jones"]
[null,null,"Jim ","Jones","Jim ","Jim","Jones",null,null,"Jim Jones","Jim Jones"]
[null,null,"Alan","Jones","Alan","Alan","Jones",null,null,"Alan Jones","Alan Jones"]
[null,null,"Trefor","Jones","Trefor","Trefor","Jones",null,null,"Trefor Jones","Trefor Jones"]
[null,null,"Chris","Jones","Chris","Chris","Jones",null,null,"Chris Jones","Chris Jones"]
[null,null,"Linda","Jones","Linda","Linda","Jones",null,null,"Linda Jones","Linda Jones"]
[null,null,"Gareth","Jones","Gareth","Gareth","Jones",null,null,"Gareth Jones","Gareth Jones"]
[null,null,"Graham","Jones","Graham","Graham","Jones",null,null,"Graham Jones","Graham Jones"]
[null,null,"David","Jones","David","David","Jones",null,null,"David Jones","David Jones"]
[null,null,"Philip","Jones","Philip","Philip","Jones",null,null,"Philip Jones","Philip Jones"]
[null,null,"Dei","Jones","Dei","Dei","Jones",null,null,"Dei Jones","Dei Jones"]
[null,null,"Stephen","Jones","Stephen","Stephen","Jones",null,null,"Stephen Jones","Stephen Jones"]
[null,null,"Ann-Marie","Jones","Ann-Marie","Ann-Marie","Jones",null,null,"Ann-Marie Jones","Ann-Marie Jones"]
[null,null,"Stephen","Jones","Stephen","Stephen","Jones",null,null,"Stephen Jones","Stephen Jones"]
[null,null,"Jayne","Joy","Jayne","Jayne","Joy",null,null,"Jayne Joy","Jayne Joy"]
[null,null,"Ben","Jozefiak","Ben","Ben","Jozefiak",null,null,"Ben Jozefiak","Ben Jozefiak"]
[null,null,"Michael","Kelly","Michael","Michael","Kelly",null,null,"Michael Kelly","Michael Kelly"]
[null,null,"Vicky","Lambert","Vicky","Vicky","Lambert",null,null,"Vicky Lambert","Vicky Lambert"]
[null,null,"Oliver","Lamford","Oliver","Oliver","Lamford",null,null,"Oliver Lamford","Oliver Lamford"]
[null,null,"Ian","Landucci","Ian","Ian","Landucci",null,null,"Ian Landucci","Ian Landucci"]
[null,null,"Rebecca","Law","Rebecca","Rebecca","Law",null,null,"Rebecca Law","Rebecca Law"]
[null,null,"Vanessa","Lawson","Vanessa","Vanessa","Lawson",null,null,"Vanessa Lawson","Vanessa Lawson"]
[null,null,"Jackie","Lee","Jackie","Jackie","Lee",null,null,"Jackie Lee","Jackie Lee"]
[null,null,"Eddie","Lesniak","Eddie","Eddie","Lesniak",null,null,"Eddie Lesniak","Eddie Lesniak"]
[null,null,"Huw","Lewis","Huw","Huw","Lewis",null,null,"Huw Lewis","Huw Lewis"]
[null,null,"Arwel","Lewis","Arwel","Arwel","Lewis",null,null,"Arwel Lewis","Arwel Lewis"]
[null,null,"Daniel","Lewis",{"$f":"IF(ISERROR(FIND(\" \",C196)),C196,MID(C196,1,FIND(\" \",C196)))","v":"Daniel"},{"$f":"TRIM(E196)","v":"Daniel"},{"$f":"TRIM(D196)","v":"Lewis"},null,null,{"$f":"_xlfn.CONCAT(F196,\" \",G196)","v":"Daniel Lewis"},{"$f":"J196","v":"Daniel Lewis"}]
[null,null,"John","Linley","John","John","Linley",null,null,"John Linley","John Linley"]
[null,null,"David","Livesey","David","David","Livesey",null,null,"David Livesey","David Livesey"]
[null,null,"Sheila","Lloyd","Sheila","Sheila","Lloyd",null,null,"Sheila Lloyd","Sheila Lloyd"]
[null,null,"Stephen","Lloyd","Stephen","Stephen","Lloyd",null,null,"Stephen Lloyd","Stephen Lloyd"]
[null,null,"Harvey","Lloyd","Harvey","Harvey","Lloyd",null,null,"Harvey Lloyd","Harvey Lloyd"]
[null,null,"Anneliese","Loveluck","Anneliese","Anneliese","Loveluck",null,null,"Anneliese Loveluck","Anneliese Loveluck"]
[null,null,"Steve","Loveluck","Steve","Steve","Loveluck",null,null,"Steve Loveluck","Steve Loveluck"]
[null,null,"Kay","Lucas","Kay","Kay","Lucas",null,null,"Kay Lucas","Kay Lucas"]
[null,null,"Martin","Lucas","Martin","Martin","Lucas",null,null,"Martin Lucas","Martin Lucas"]
[null,null,"Ciaran","Lynch","Ciaran","Ciaran","Lynch",null,null,"Ciaran Lynch","Ciaran Lynch"]
[null,null,"Ian","Macklin","Ian","Ian","Macklin",null,null,"Ian Macklin","Ian Macklin"]
[null,null,"Russell","Mapp","Russell","Russell","Mapp",null,null,"Russell Mapp","Russell Mapp"]
[null,null,"Steven","Marham","Steven","Steven","Marham",null,null,"Steven Marham","Steven Marham"]
[null,null,"David","Marham","David","David","Marham",null,null,"David Marham","David Marham"]
[null,null,"Helen","Marshall","Helen","Helen","Marshall",null,null,"Helen Marshall","Helen Marshall"]
[null,null,"Rob","Martin","Rob","Rob","Martin",null,null,"Rob Martin","Rob Martin"]
[null,null,"Jim","Masters","Jim","Jim","Masters",null,null,"Jim Masters","Jim Masters"]
[null,null,"Stuart","McDonald","Stuart","Stuart","McDonald",null,null,"Stuart McDonald","Stuart McDonald"]
[null,null,"Michael","McLoughlin","Michael","Michael","McLoughlin",null,null,"Michael McLoughlin","Michael McLoughlin"]
[null,null,"Graham","Mcvey","Graham","Graham","Mcvey",null,null,"Graham Mcvey","Graham Mcvey"]
[null,null,"Eric","Meredith","Eric","Eric","Meredith",null,null,"Eric Meredith","Eric Meredith"]
[null,null,"Tracy","Miles","Tracy","Tracy","Miles",null,null,"Tracy Miles","Tracy Miles"]
[null,null,"Celia","Mills","Celia","Celia","Mills",null,null,"Celia Mills","Celia Mills"]
[null,null,"Thomas","Mollekin","Thomas","Thomas","Mollekin",null,null,"Thomas Mollekin","Thomas Mollekin"]
[null,null,"Benjamin","Moon","Benjamin","Benjamin","Moon",null,null,"Benjamin Moon","Benjamin Moon"]
[null,null,"Stuart","Moore","Stuart","Stuart","Moore",null,null,"Stuart Moore","Stuart Moore"]
[null,null,"Pete","Morfey","Pete","Pete","Morfey",null,null,"Pete Morfey","Pete Morfey"]
[null,null,"Niki","Morgan","Niki","Niki","Morgan",null,null,"Niki Morgan","Niki Morgan"]
[null,null,"Richard","Morgan-Evans","Richard","Richard","Morgan-Evans",null,null,"Richard Morgan-Evans","Richard Morgan-Evans"]
[null,null,"Stephen ","Morran","Stephen ","Stephen","Morran",null,null,"Stephen Morran","Stephen Morran"]
[null,null,"John","Morris","John","John","Morris",null,null,"John Morris","John Morris"]
[null,null,"Ben","Morris","Ben","Ben","Morris",null,null,"Ben Morris","Ben Morris"]
[null,null,"James","Morrison","James","James","Morrison",null,null,"James Morrison","James Morrison"]
[null,null,"Russell","Murray","Russell","Russell","Murray",null,null,"Russell Murray","Russell Murray"]
[null,null,"Paul","Murrin","Paul","Paul","Murrin",null,null,"Paul Murrin","Paul Murrin"]
[null,null,"Chris","Near","Chris","Chris","Near",null,null,"Chris Near","Chris Near"]
[null,null,"Mark ","Nelson","Mark ","Mark","Nelson",null,null,"Mark Nelson","Mark Nelson"]
[null,null,"Brian","Nevin","Brian","Brian","Nevin",null,null,"Brian Nevin","Brian Nevin"]
[null,null,"Pete","Norman","Pete","Pete","Norman",null,null,"Pete Norman","Pete Norman"]
[null,null,"Paddy","Nugent","Paddy","Paddy","Nugent",null,null,"Paddy Nugent","Paddy Nugent"]
[null,null,"Jim ","O'Hara","Jim ","Jim","O'Hara",null,null,"Jim O'Hara","Jim O'Hara"]
[null,null,"Paul","Oldfield","Paul","Paul","Oldfield",null,null,"Paul Oldfield","Paul Oldfield"]
[null,null,"Maggie","Oliver","Maggie","Maggie","Oliver",null,null,"Maggie Oliver","Maggie Oliver"]
[null,null,"Alwyn","Oliver","Alwyn","Alwyn","Oliver",null,null,"Alwyn Oliver","Alwyn Oliver"]
[null,null,"Timothy ","Osman","Timothy ","Timothy","Osman",null,null,"Timothy Osman","Timothy Osman"]
[null,null,"Nicholas","Owen","Nicholas","Nicholas","Owen",null,null,"Nicholas Owen","Nicholas Owen"]
[null,null,"Emlyn","Owen","Emlyn","Emlyn","Owen",null,null,"Emlyn Owen","Emlyn Owen"]
[null,null,"Howard","Owen","Howard","Howard","Owen",null,null,"Howard Owen","Howard Owen"]
[null,null,"Paul","Padget","Paul","Paul","Padget",null,null,"Paul Padget","Paul Padget"]
[null,null,"Tim","Palmer","Tim","Tim","Palmer",null,null,"Tim Palmer","Tim Palmer"]
[null,null,"Mark ","Palmer","Mark ","Mark","Palmer",null,null,"Mark Palmer","Mark Palmer"]
[null,null,"John","Parkinson","John","John","Parkinson",null,null,"John Parkinson","John Parkinson"]
[null,null,"Oliver","Parry","Oliver","Oliver","Parry",null,null,"Oliver Parry","Oliver Parry"]
[null,null,"Gwyneth","Parry","Gwyneth","Gwyneth","Parry",null,null,"Gwyneth Parry","Gwyneth Parry"]
[null,null,"Wayne","Percival","Wayne","Wayne","Percival",null,null,"Wayne Percival","Wayne Percival"]
[null,null,"Carwyn","Phillips","Carwyn","Carwyn","Phillips",null,null,"Carwyn Phillips","Carwyn Phillips"]
[null,null,"Stephen","Pilbeam","Stephen","Stephen","Pilbeam",null,null,"Stephen Pilbeam","Stephen Pilbeam"]
[null,null,"Gary","Porter-Jones","Gary","Gary","Porter-Jones",null,null,"Gary Porter-Jones","Gary Porter-Jones"]
[null,null,"Martin","Potter","Martin","Martin","Potter",null,null,"Martin Potter","Martin Potter"]
[null,null,"Ross","Powell","Ross","Ross","Powell",null,null,"Ross Powell","Ross Powell"]
[null,null,"Richard","Powell","Richard","Richard","Powell",null,null,"Richard Powell","Richard Powell"]
[null,null,"Anthony ","Powell","Anthony ","Anthony","Powell",null,null,"Anthony Powell","Anthony Powell"]
[null,null,"Dave","Powell","Dave","Dave","Powell",null,null,"Dave Powell","Dave Powell"]
[null,null,"Julian","Price",{"$f":"IF(ISERROR(FIND(\" \",C260)),C260,MID(C260,1,FIND(\" \",C260)))","v":"Julian"},{"$f":"TRIM(E260)","v":"Julian"},{"$f":"TRIM(D260)","v":"Price"},null,null,{"$f":"_xlfn.CONCAT(F260,\" \",G260)","v":"Julian Price"},{"$f":"J260","v":"Julian Price"}]
[null,null,"Rhian","Probert","Rhian","Rhian","Probert",null,null,"Rhian Probert","Rhian Probert"]
[null,null,"Willem van","Prooijen","Willem ","Willem","Prooijen",null,null,"Willem Prooijen","Willem Prooijen"]
[null,null,"Colin","Prosser","Colin","Colin","Prosser",null,null,"Colin Prosser","Colin Prosser"]
[null,null,"Leslie","Pugh","Leslie","Leslie","Pugh",null,null,"Leslie Pugh","Leslie Pugh"]
[null,null,"Jeremy","Randell","Jeremy","Jeremy","Randell",null,null,"Jeremy Randell","Jeremy Randell"]
[null,null,"Owen","Rees","Owen","Owen","Rees",null,null,"Owen Rees","Owen Rees"]
[null,null,"Lyn","Rees","Lyn","Lyn","Rees",null,null,"Lyn Rees","Lyn Rees"]
[null,null,"Susan","Ridings","Susan","Susan","Ridings",null,null,"Susan Ridings","Susan Ridings"]
[null,null,"Joanna","Ridley","Joanna","Joanna","Ridley",null,null,"Joanna Ridley","Joanna Ridley"]
[null,null,"Iorwerth","Roberts","Iorwerth","Iorwerth","Roberts",null,null,"Iorwerth Roberts","Iorwerth Roberts"]
[null,null,"Matthew","Roberts","Matthew","Matthew","Roberts",null,null,"Matthew Roberts","Matthew Roberts"]
[null,null,"Iolo","Roberts","Iolo","Iolo","Roberts",null,null,"Iolo Roberts","Iolo Roberts"]
[null,null,"Dewi","Roberts","Dewi","Dewi","Roberts",null,null,"Dewi Roberts","Dewi Roberts"]
[null,null,"Simon","Roberts","Simon","Simon","Roberts",null,null,"Simon Roberts","Simon Roberts"]
[null,null,"Peter","Roberts","Peter","Peter","Roberts",null,null,"Peter Roberts","Peter Roberts"]
[null,null,"Rick","Robson","Rick","Rick","Robson",null,null,"Rick Robson","Rick Robson"]
[null,null,"Sandra","Rowlands","Sandra","Sandra","Rowlands",null,null,"Sandra Rowlands","Sandra Rowlands"]
[null,null,"Kean","Rowlands","Kean","Kean","Rowlands",null,null,"Kean Rowlands","Kean Rowlands"]
[null,null,"Nigel","Rowlands","Nigel","Nigel","Rowlands",null,null,"Nigel Rowlands","Nigel Rowlands"]
[null,null,"Peter ","Ryder","Peter ","Peter","Ryder",null,null,"Peter Ryder","Peter Ryder"]
[null,null,"Eluned","Salisbury","Eluned","Eluned","Salisbury",null,null,"Eluned Salisbury","Eluned Salisbury"]
[null,null,"Dan","Sandford","Dan","Dan","Sandford",null,null,"Dan Sandford","Dan Sandford"]
[null,null,"David","Say","David","David","Say",null,null,"David Say","David Say"]
[null,null,"Dirk","Schmaljohann","Dirk","Dirk","Schmaljohann",null,null,"Dirk Schmaljohann","Dirk Schmaljohann"]
[null,null,"Dominic","Shields","Dominic","Dominic","Shields",null,null,"Dominic Shields","Dominic Shields"]
[null,null,"Chris","Smallman","Chris","Chris","Smallman",null,null,"Chris Smallman","Chris Smallman"]
[null,null,"Andy","Smith","Andy","Andy","Smith",null,null,"Andy Smith","Andy Smith"]
[null,null,"Graham","Spencer","Graham","Graham","Spencer",null,null,"Graham Spencer","Graham Spencer"]
[null,null,"John","Sproson","John","John","Sproson",null,null,"John Sproson","John Sproson"]
[null,null,"Andy ","Staveley","Andy ","Andy","Staveley",null,null,"Andy Staveley","Andy Staveley"]
[null,null,"Karl","Steinegger","Karl","Karl","Steinegger",null,null,"Karl Steinegger","Karl Steinegger"]
[null,null,"Tom","Stenning","Tom","Tom","Stenning",null,null,"Tom Stenning","Tom Stenning"]
[null,null,"Alan","Stone","Alan","Alan","Stone",null,null,"Alan Stone","Alan Stone"]
[null,null,"Mike","Storry","Mike","Mike","Storry",null,null,"Mike Storry","Mike Storry"]
[null,null,"Graeme","Stringer","Graeme","Graeme","Stringer",null,null,"Graeme Stringer","Graeme Stringer"]
[null,null,"Rod","Sutcliffe","Rod","Rod","Sutcliffe",null,null,"Rod Sutcliffe","Rod Sutcliffe"]
[null,null,"John","Sweeting","John","John","Sweeting",null,null,"John Sweeting","John Sweeting"]
[null,null,"Paul","Symons","Paul","Paul","Symons",null,null,"Paul Symons","Paul Symons"]
[null,null,"Lloyd ","Taggart","Lloyd ","Lloyd","Taggart",null,null,"Lloyd Taggart","Lloyd Taggart"]
[null,null,"Peter","Taylor","Peter","Peter","Taylor",null,null,"Peter Taylor","Peter Taylor"]
[null,null,"Christopher","Taylor","Christopher","Christopher","Taylor",null,null,"Christopher Taylor","Christopher Taylor"]
[null,null,"Jessica","Taylor","Jessica","Jessica","Taylor",null,null,"Jessica Taylor","Jessica Taylor"]
[null,null,"Rob","Thomson","Rob","Rob","Thomson",null,null,"Rob Thomson","Rob Thomson"]
[null,null,"Rachel","Thurlow","Rachel","Rachel","Thurlow",null,null,"Rachel Thurlow","Rachel Thurlow"]
[null,null,"Jim","Tinnion","Jim","Jim","Tinnion",null,null,"Jim Tinnion","Jim Tinnion"]
[null,null,"Jason","Tompkins","Jason","Jason","Tompkins",null,null,"Jason Tompkins","Jason Tompkins"]
[null,null,"Michael Anthony","Tong","Michael ","Michael","Tong",null,null,"Michael Tong","Michael Tong"]
[null,null,"Steve","Toogood","Steve","Steve","Toogood",null,null,"Steve Toogood","Steve Toogood"]
[null,null,"Ian","Travis","Ian","Ian","Travis",null,null,"Ian Travis","Ian Travis"]
[null,null,"Yiannis","Tridimas","Yiannis","Yiannis","Tridimas",null,null,"Yiannis Tridimas","Yiannis Tridimas"]
[null,null,"Wendy","Trimbel","Wendy","Wendy","Trimbel",null,null,"Wendy Trimbel","Wendy Trimbel"]
[null,null,"Bev","Tucker","Bev","Bev","Tucker",null,null,"Bev Tucker","Bev Tucker"]
[null,null,"Paul","Tucker","Paul","Paul","Tucker",null,null,"Paul Tucker","Paul Tucker"]
[null,null,"Hayley","Turner","Hayley","Hayley","Turner",null,null,"Hayley Turner","Hayley Turner"]
[null,null,"Alastair","Tye","Alastair","Alastair","Tye",null,null,"Alastair Tye","Alastair Tye"]
[null,null,"Francis","Uhlman","Francis","Francis","Uhlman",null,null,"Francis Uhlman","Francis Uhlman"]
[null,null,"Dimitri","Vorres","Dimitri","Dimitri","Vorres",null,null,"Dimitri Vorres","Dimitri Vorres"]
[null,null,"Christine","Vorres","Christine","Christine","Vorres",null,null,"Christine Vorres","Christine Vorres"]
[null,null,"Richard","Wall","Richard","Richard","Wall",null,null,"Richard Wall","Richard Wall"]
[null,null,"Jane ","Ward","Jane ","Jane","Ward",null,null,"Jane Ward","Jane Ward"]
[null,null,"Richard","Watson","Richard","Richard","Watson",null,null,"Richard Watson","Richard Watson"]
[null,null,"Robert","West","Robert","Robert","West",null,null,"Robert West","Robert West"]
[null,null,"David","Whiley","David","David","Whiley",null,null,"David Whiley","David Whiley"]
[null,null,"Victoria","Whitehead",{"$f":"IF(ISERROR(FIND(\" \",C324)),C324,MID(C324,1,FIND(\" \",C324)))","v":"Victoria"},{"$f":"TRIM(E324)","v":"Victoria"},{"$f":"TRIM(D324)","v":"Whitehead"},null,null,{"$f":"_xlfn.CONCAT(F324,\" \",G324)","v":"Victoria Whitehead"},{"$f":"J324","v":"Victoria Whitehead"}]
[null,null,"Chris","Wilcox","Chris","Chris","Wilcox",null,null,"Chris Wilcox","Chris Wilcox"]
[null,null,"Darran","Williams","Darran","Darran","Williams",null,null,"Darran Williams","Darran Williams"]
[null,null,"Owen","Williams","Owen","Owen","Williams",null,null,"Owen Williams","Owen Williams"]
[null,null,"Sian","Williams","Sian","Sian","Williams",null,null,"Sian Williams","Sian Williams"]
[null,null,"Haydn","Williams","Haydn","Haydn","Williams",null,null,"Haydn Williams","Haydn Williams"]
[null,null,"Rhys","Williams","Rhys","Rhys","Williams",null,null,"Rhys Williams","Rhys Williams"]
[null,null,"Karl ","Williams","Karl ","Karl","Williams",null,null,"Karl Williams","Karl Williams"]
[null,null,"Alwyn","Williams","Alwyn","Alwyn","Williams",null,null,"Alwyn Williams","Alwyn Williams"]
[null,null,"Peter Gareth","Williams","Peter ","Peter","Williams",null,null,"Peter Williams","Peter Williams"]
[null,null,"Leslie Rees","Williams","Leslie ","Leslie","Williams",null,null,"Leslie Williams","Leslie Williams"]
[null,null,"Alice","Williams","Alice","Alice","Williams",null,null,"Alice Williams","Alice Williams"]
[null,null,"Calvin","Williams","Calvin","Calvin","Williams",null,null,"Calvin Williams","Calvin Williams"]
[null,null,"Colin","Williamson","Colin","Colin","Williamson",null,null,"Colin Williamson","Colin Williamson"]
[null,null,"Stan M.","Winstanley","Stan ","Stan","Winstanley",null,null,"Stan Winstanley","Stan Winstanley"]
[null,null,"James Peter","Woodier","James ","James","Woodier",null,null,"James Woodier","James Woodier"]
[null,null,"Bridget J.","Woodward","Bridget ","Bridget","Woodward",null,null,"Bridget Woodward","Bridget Woodward"]
[null,null,"Tony","Wooldridge","Tony","Tony","Wooldridge",null,null,"Tony Wooldridge","Tony Wooldridge"]
[null,null,"Kate","Worthington","Kate","Kate","Worthington",null,null,"Kate Worthington","Kate Worthington"]
[null,null,"Andy","Worthington","Andy","Andy","Worthington",null,null,"Andy Worthington","Andy Worthington"]
[null,null,"David","York","David","David","York",null,null,"David York","David York"]
[null,null,"Jonathan","Moore","Jonathan","Jonathan","Moore",null,null,"Jonathan Moore","Jonathan Moore"]
[null,null,"Alan","Duckers","Alan","Alan","Duckers",null,null,"Alan Duckers","Alan Duckers"]
[null,null,"Samuel","Ryall","Samuel","Samuel","Ryall",null,null,"Samuel Ryall","Samuel Ryall"]
[null,null,"Kimberley Ann","Braznell","Kimberley ","Kimberley","Braznell",null,null,"Kimberley Braznell","Kimberley Braznell"]
[null,null,"Gruff","Jones","Gruff","Gruff","Jones",null,null,"Gruff Jones","Gruff Jones"]
[null,null,"Lou","Summers","Lou","Lou","Summers",null,null,"Lou Summers","Lou Summers"]
[null,null,"John","Hamilton","John","John","Hamilton",null,null,"John Hamilton","John Hamilton"]
[null,null,"Christopher","Kelsey","Christopher","Christopher","Kelsey",null,null,"Christopher Kelsey","Christopher Kelsey"]
[null,null,"Daniel","Lewis","Daniel","Daniel","Lewis",null,null,"Daniel Lewis","Daniel Lewis"]
[null,null,"Hugh","Aggleton","Hugh","Hugh","Aggleton",null,null,"Hugh Aggleton","Hugh Aggleton"]
[null,null,"John","Aggleton","John","John","Aggleton",null,null,"John Aggleton","John Aggleton"]
[null,null,"Martin","Webb","Martin","Martin","Webb",null,null,"Martin Webb","Martin Webb"]
[null,null,"Graeme","Hughes","Graeme","Graeme","Hughes",null,null,"Graeme Hughes","Graeme Hughes"]
[null,null,"Sue","Howarth","Sue","Sue","Howarth",null,null,"Sue Howarth","Sue Howarth"]
[null,null,"Ray","Pickett","Ray","Ray","Pickett",null,null,"Ray Pickett","Ray Pickett"]
[null,null,"Neil","Lewis","Neil","Neil","Lewis",null,null,"Neil Lewis","Neil Lewis"]
[null,null,"Nick","Biggs","Nick","Nick","Biggs",null,null,"Nick Biggs","Nick Biggs"]
[null,null,"Angela","Price","Angela","Angela","Price",null,null,"Angela Price","Angela Price"]
[null,null,"Ruth","Metcalfe","Ruth","Ruth","Metcalfe",null,null,"Ruth Metcalfe","Ruth Metcalfe"]
[null,null,"Chris","Sorsby","Chris","Chris","Sorsby",null,null,"Chris Sorsby","Chris Sorsby"]
[null,null,"Anthony","Davies","Anthony","Anthony","Davies",null,null,"Anthony Davies","Anthony Davies"]
[null,null,"Gareth","Welch","Gareth","Gareth","Welch",null,null,"Gareth Welch","Gareth Welch"]
[null,null,"Daragh","Reynolds","Daragh","Daragh","Reynolds",null,null,"Daragh Reynolds","Daragh Reynolds"]
[null,null,"Victoria","Knight","Victoria","Victoria","Knight",null,null,"Victoria Knight","Victoria Knight"]
[null,null,"Sam","Orton","Sam","Sam","Orton",null,null,"Sam Orton","Sam Orton"]
[null,null,"Andy","Pritchard","Andy","Andy","Pritchard",null,null,"Andy Pritchard","Andy Pritchard"]
[null,null,"Nic","Brook","Nic","Nic","Brook",null,null,"Nic Brook","Nic Brook"]
[null,null,"John","Humphries","John","John","Humphries",null,null,"John Humphries","John Humphries"]
[null,null,"Andrew","Brasington","Andrew","Andrew","Brasington",null,null,"Andrew Brasington","Andrew Brasington"]
[null,null,"Helen","Andrews","Helen","Helen","Andrews",null,null,"Helen Andrews","Helen Andrews"]
[null,null,"Tom","Andrews","Tom","Tom","Andrews",null,null,"Tom Andrews","Tom Andrews"]
[null,null,"Tina","Usherwood","Tina","Tina","Usherwood",null,null,"Tina Usherwood","Tina Usherwood"]
[null,null,"Anthony","Howells","Anthony","Anthony","Howells",null,null,"Anthony Howells","Anthony Howells"]
[null,null,"Steve","Turk","Steve","Steve","Turk",null,null,"Steve Turk","Steve Turk"]
[null,null,"Naomi","Prosser","Naomi","Naomi","Prosser",null,null,"Naomi Prosser","Naomi Prosser"]
[null,null,"Niki","Radnedge","Niki","Niki","Radnedge",null,null,"Niki Radnedge","Niki Radnedge"]
[null,null,"Patrick","Tudor","Patrick","Patrick","Tudor",null,null,"Patrick Tudor","Patrick Tudor"]
[null,null,"Gerallt","Williams","Gerallt","Gerallt","Williams",null,null,"Gerallt Williams","Gerallt Williams"]
[null,null,"Llinos","Davies","Llinos","Llinos","Davies",null,null,"Llinos Davies","Llinos Davies"]
[null,null,"Aneurin","James","Aneurin","Aneurin","James",null,null,"Aneurin James","Aneurin James"]
[null,null,"Lisa","Grantham","Lisa","Lisa","Grantham",null,null,"Lisa Grantham","Lisa Grantham"]
[null,null,"Susan","Fourie","Susan","Susan","Fourie",null,null,"Susan Fourie","Susan Fourie"]
[null,null,"Nigel","Crompton","Nigel","Nigel","Crompton",null,null,"Nigel Crompton","Nigel Crompton"]
[null,null,"Mathew","Prichard",{"$f":"IF(ISERROR(FIND(\" \",C388)),C388,MID(C388,1,FIND(\" \",C388)))","v":"Mathew"},{"$f":"TRIM(E388)","v":"Mathew"},{"$f":"TRIM(D388)","v":"Prichard"},null,null,{"$f":"_xlfn.CONCAT(F388,\" \",G388)","v":"Mathew Prichard"},{"$f":"J388","v":"Mathew Prichard"}]
[null,null,"Helen","Davies","Helen","Helen","Davies",null,null,"Helen Davies","Helen Davies"]
[null,null,"Gwion","Williams","Gwion","Gwion","Williams",null,null,"Gwion Williams","Gwion Williams"]
[null,null,"Ben","Arkell","Ben","Ben","Arkell",null,null,"Ben Arkell","Ben Arkell"]
[null,null,"Paul","Jenkinson","Paul","Paul","Jenkinson",null,null,"Paul Jenkinson","Paul Jenkinson"]
[null,null,"Bronwen","Jenkinson","Bronwen","Bronwen","Jenkinson",null,null,"Bronwen Jenkinson","Bronwen Jenkinson"]
[null,null,"George","Fisher","George","George","Fisher",null,null,"George Fisher","George Fisher"]
[null,null,"Max","Burns","Max","Max","Burns",null,null,"Max Burns","Max Burns"]
[null,null,"Anna","Nakamura","Anna","Anna","Nakamura",null,null,"Anna Nakamura","Anna Nakamura"]
[null,null,"Gareth","Hughes","Gareth","Gareth","Hughes",null,null,"Gareth Hughes","Gareth Hughes"]
[null,null,"Andrew","Starling","Andrew","Andrew","Starling",null,null,"Andrew Starling","Andrew Starling"]
[null,null,"Billy","Starling","Billy","Billy","Starling",null,null,"Billy Starling","Billy Starling"]
[null,null,"Joe","Starling","Joe","Joe","Starling",null,null,"Joe Starling","Joe Starling"]
[null,null,"Graham Alexander","Brown","Graham ","Graham","Brown",null,null,"Graham Brown","Graham Brown"]
[null,null,"Edward James","Dickson","Edward ","Edward","Dickson",null,null,"Edward Dickson","Edward Dickson"]
[null,null,"Gareth John","Lynch","Gareth ","Gareth","Lynch",null,null,"Gareth Lynch","Gareth Lynch"]
[null,null,"Allan Stephen","Jones","Allan ","Allan","Jones",null,null,"Allan Jones","Allan Jones"]
[null,null,"Helen","MacArthur","Helen","Helen","MacArthur",null,null,"Helen MacArthur","Helen MacArthur"]
[null,null,"Ceri","Belshaw","Ceri","Ceri","Belshaw",null,null,"Ceri Belshaw","Ceri Belshaw"]
[null,null,"Tristan","Evans","Tristan","Tristan","Evans",null,null,"Tristan Evans","Tristan Evans"]
[null,null,"Graham","Jones","Graham","Graham","Jones",null,null,"Graham Jones","Graham Jones"]
[null,null,"Richard","Cronin","Richard","Richard","Cronin",null,null,"Richard Cronin","Richard Cronin"]
[null,null,"Gwyn","Williams","Gwyn","Gwyn","Williams",null,null,"Gwyn Williams","Gwyn Williams"]
[null,null,"Stuart","Duncan","Stuart","Stuart","Duncan",null,null,"Stuart Duncan","Stuart Duncan"]
[null,null,"Ed","Goldsmith","Ed","Ed","Goldsmith",null,null,"Ed Goldsmith","Ed Goldsmith"]
[null,null,"Matt","Lister","Matt","Matt","Lister",null,null,"Matt Lister","Matt Lister"]