{"text_format":"1","workbook":"xlsx","n_sheets":10,"sheets":["Series Winners","Series Table","Llanbedr 2 Bleanafon","Longtown Loop","Cwmdu","Middletown Show","Guto Nyth Bran","Brecon Beacons","Fan Fawr","WFRA Membership March 2017"],"not_rendered":{"charts":0,"images":1,"macros":1,"external_links":2,"defined_names":59,"comments":0,"pivot_tables":0},"unopened":[],"bounds":{"document_bytes":16777216,"sheet_cells":100000,"rows_first":2000,"rows_last":500,"rows_between":2000,"halvings":0,"cell_chars":16384,"cell_head_chars":4096},"cells_cut":0,"cells_raw":0,"read":"whole","date_system":"1900"}

{"sheet":"Series Winners","index":0,"n_rows":22,"n_cols":11,"rows_kept":22,"cut":false,"hidden":false,"merged":[]}
[]
[]
[]
[null,"Name","Club","Point","Races completed",null,null,"Name","Club","Point","Races completed"]
[null,"M",null,null,null,null,null,"F"]
[1,null,null,null,null,null,1]
[2,null,null,null,null,null,2]
[]
[null,"MO40",null,null,null,null,null,"FO40"]
[1,null,null,null,null,null,1]
[2,null,null,null,null,null,2]
[3]
[]
[null,"M050",null,null,null,null,null,"FO50"]
[1,null,null,null,null,null,1]
[2,null,null,null,null,null,2]
[]
[null,"MO60"]
[1]
[]
{"$rows_left_out":3}
{"sheet":"Series Table","index":1,"n_rows":258,"n_cols":24,"rows_kept":258,"cut":false,"hidden":false,"merged":[[0,18,0,19],[0,16,0,17],[0,6,0,7],[0,8,0,9],[0,10,0,11],[0,12,0,13],[0,14,0,15]]}
[null,"2018 WFRA",null,null,null,null,"Llanbedr 2 Bleanafon",null,"Longtown Loop",null,"Cwmdu",null,"Middletown Show",null,"Guto Nyth Bran",null,"Brecon Beacons",null,"Fan Fawr"]
["Pos","Name","Club","Gender","Cat.","Total","Time","Score","Time","Score","Time","Score","Time","Score","Time","Score","Time","Score","Time","Score","Competed","Ave (Best of 4)",null,"WFRA membership as of March 2018"]
[{"$f":"ROW(A1)","v":1},"Matt O'Keefe",{"$f":"IFERROR(VLOOKUP(B3,INDIRECT(\"'\"&$I$1&\"'!\"&\"$C$2:$H$200\"),2,FALSE),\"\")","v":"MDC"},{"$f":"IFERROR(VLOOKUP(B3,INDIRECT(\"'\"&$I$1&\"'!\"&\"$C$2:$H$200\"),3,FALSE),\"\")","v":"M"},{"$f":"IFERROR(VLOOKUP(B3,INDIRECT(\"'\"&$I$1&\"'!\"&\"$C$2:$H$200\"),4,FALSE),\"\")","v":"SM"},{"$f":"SUM(LARGE((H3,J3,L3,N3,P3,R3),{1,2,3,4}))","v":357.40339779503353},{"$f":"IFERROR(VLOOKUP(B3,INDIRECT(\"'\"&$G$1&\"'!\"&\"$C$2:$H$200\"),5,FALSE),\"\")","v":"02:27:24"},{"$f":"IFERROR(VLOOKUP(B3,INDIRECT(\"'\"&$G$1&\"'!\"&\"$C$2:$H$200\"),6,FALSE),0)","v":124.68833026772941},{"$f":"IFERROR(VLOOKUP(B3,INDIRECT(\"'\"&$I$1&\"'!\"&\"$C$2:$G$200\"),5,FALSE),\"\")","v":3.0201388888888889},{"$f":"IFERROR(VLOOKUP(B3,INDIRECT(\"'\"&$I$1&\"'!\"&\"$C$2:$H$200\"),6,FALSE),0)","v":122.38086739246832},{"$f":"IFERROR(VLOOKUP(B3,INDIRECT(\"'\"&$K$1&\"'!\"&\"$C$2:$H$200\"),5,FALSE),\"\")","v":"01:33:06"},{"$f":"IFERROR(VLOOKUP(B3,INDIRECT(\"'\"&$K$1&\"'!\"&\"$C$2:$H$200\"),6,FALSE),0)","v":110.3342001348358},{"$f":"IFERROR(VLOOKUP(B3,INDIRECT(\"'\"&$M$1&\"'!\"&\"$C$2:$h$200\"),5,FALSE),\"\")","v":""},{"$f":"IFERROR(VLOOKUP(B3,INDIRECT(\"'\"&$M$1&\"'!\"&\"$C$2:$h$200\"),6,FALSE),0)","v":0},{"$f":"IFERROR(VLOOKUP(B3,INDIRECT(\"'\"&$O$1&\"'!\"&\"$C$2:$h$200\"),5,FALSE),\"\")","v":""},{"$f":"IFERROR(VLOOKUP(B3,INDIRECT(\"'\"&$O$1&\"'!\"&\"$C$2:$h$200\"),6,FALSE),0)","v":0},{"$f":"IFERROR(VLOOKUP(B3,INDIRECT(\"'\"&$Q$1&\"'!\"&\"$C$2:$h$200\"),5,FALSE),\"\")","v":""},{"$f":"IFERROR(VLOOKUP(B3,INDIRECT(\"'\"&$Q$1&\"'!\"&\"$C$2:$h$200\"),6,FALSE),0)","v":0},{"$f":"IFERROR(VLOOKUP(D3,INDIRECT(\"'\"&$Q$1&\"'!\"&\"$C$2:$h$200\"),5,FALSE),\"\")","v":""},{"$f":"IFERROR(VLOOKUP(D3,INDIRECT(\"'\"&$S$1&\"'!\"&\"$C$2:$h$200\"),6,FALSE),0)","v":0},{"$f":"7-COUNTIF(G3:T3,\"\")","v":3},{"$f":"F3/IF(U3>4,4,U3)","v":119.13446593167784}]
[{"$f":"ROW(A2)","v":2},"Dan Sandford",{"$f":"IFERROR(VLOOKUP(B4,INDIRECT(\"'\"&$I$1&\"'!\"&\"$C$2:$H$200\"),2,FALSE),\"\")","v":"FODAC"},{"$f":"IFERROR(VLOOKUP(B4,INDIRECT(\"'\"&$I$1&\"'!\"&\"$C$2:$H$200\"),3,FALSE),\"\")","v":"M"},{"$f":"IFERROR(VLOOKUP(B4,INDIRECT(\"'\"&$I$1&\"'!\"&\"$C$2:$H$200\"),4,FALSE),\"\")","v":"MV40"},{"$f":"SUM(LARGE((H4,J4,L4,N4,P4,R4),{1,2,3,4}))","v":352.21785631615694},"02:31:11",122.75529668233531,3.1854166666666668,118.13314295912902,"01:32:04",111.32941667469262,"",0,"",0,"",0,"",0,3,117.40595210538565]
[3,"Helen Brown",{"$f":"IFERROR(VLOOKUP(B5,INDIRECT(\"'\"&$K$1&\"'!\"&\"$C$2:$H$200\"),2,FALSE),\"\")","v":"Mynydd Du"},{"$f":"IFERROR(VLOOKUP(B5,INDIRECT(\"'\"&$K$1&\"'!\"&\"$C$2:$H$200\"),3,FALSE),\"\")","v":"F"},{"$f":"IFERROR(VLOOKUP(B5,INDIRECT(\"'\"&$K$1&\"'!\"&\"$C$2:$H$200\"),4,FALSE),\"\")","v":"F40"},{"$f":"SUM(LARGE((H5,J5,L5,N5,P5,R5),{1,2,3,4}))","v":339.23768255215384},"02:41:09",117.66298794195791,3.4486111111111111,111.36890951276102,"01:33:14",110.2057850974349,"",0,"",0,"",0,"",0,3,113.07922751738461]
[4,"John Aggleton",{"$f":"IFERROR(VLOOKUP(B6,INDIRECT(\"'\"&$I$1&\"'!\"&\"$C$2:$H$200\"),2,FALSE),\"\")","v":"MDC"},{"$f":"IFERROR(VLOOKUP(B6,INDIRECT(\"'\"&$I$1&\"'!\"&\"$C$2:$H$200\"),3,FALSE),\"\")","v":"M"},{"$f":"IFERROR(VLOOKUP(B6,INDIRECT(\"'\"&$I$1&\"'!\"&\"$C$2:$H$200\"),4,FALSE),\"\")","v":"MV60"},{"$f":"SUM(LARGE((H6,J6,L6,N6,P6,R6),{1,2,3,4}))","v":331.96614664739946},"02:49:48",113.24340895156344,3.4527777777777775,111.26182402284491,"01:36:05",107.46091367299111,"",0,"",0,"",0,"",0,3,110.65538221579982]
[5,"Paul Tucker","Mynydd Du","M","MV50",{"$f":"SUM(LARGE((H7,J7,L7,N7,P7,R7),{1,2,3,4}))","v":315.33969293792336},"03:08:20",103.77409905306901,3.6444444444444444,106.33589148670355,"01:38:24",105.22970239815082,"",0,"",0,"",0,"",0,3,105.11323097930779]
[6,"Rhian Probert","Mynydd Du","F","FV40",{"$f":"SUM(LARGE((H8,J8,L8,N8,P8,R8),{1,2,3,4}))","v":315.20009279017114},"02:58:49",108.63648749914843,3.6979166666666665,104.96162769944672,"01:42:10",101.60197759157596,"",0,"",0,"",0,"",0,3,105.06669759672371]
[7,"Debbie Stenner","Forest of Dean AC","F","FV40",{"$f":"SUM(LARGE((H9,J9,L9,N9,P9,R9),{1,2,3,4}))","v":300.20200929246784},"03:14:15",100.75107296137338,3.692361111111111,105.10440835266822,"01:49:42",94.346527978426266,"",0,"",0,"",0,"",0,3,100.06733643082261]
[8,"gareth welch",0,"M","MV40",{"$f":"SUM(LARGE((H10,J10,L10,N10,P10,R10),{1,2,3,4}))","v":270.84201025169074},"03:45:29",84.792901423802689,4.0145833333333334,96.823130465821876,"01:55:01",89.225978362066186,"",0,"",0,"",0,"",0,3,90.280670083896908]
[9,"John Jaspers",0,"M","MV40",{"$f":"SUM(LARGE((H11,J11,L11,N11,P11,R11),{1,2,3,4}))","v":266.03409564839285},"03:44:27",85.320866544042502,4.1909722222222223,92.289844726039604,"01:55:51",88.423384378310715,"",0,"",0,"",0,"",0,3,88.678031882797612]
[10,"Peter Ryder","Aberdare Valley","M","SM",{"$f":"SUM(LARGE((H12,J12,L12,N12,P12,R12),{1,2,3,4}))","v":257.72925792517913},"02:15:35",130.72586688466515,2.8402777777777781,127.00339104051399,"",0,"",0,"",0,"",0,"",0,2,128.86462896258956]
[11,"Caroline Dallimore",{"$f":"IFERROR(VLOOKUP(B13,INDIRECT(\"'\"&$K$1&\"'!\"&\"$C$2:$H$200\"),2,FALSE),\"\")","v":"MDC"},{"$f":"IFERROR(VLOOKUP(B13,INDIRECT(\"'\"&$K$1&\"'!\"&\"$C$2:$H$200\"),3,FALSE),\"\")","v":"F"},{"$f":"IFERROR(VLOOKUP(B13,INDIRECT(\"'\"&$K$1&\"'!\"&\"$C$2:$H$200\"),4,FALSE),\"\")","v":"F60"},{"$f":"SUM(LARGE((H13,J13,L13,N13,P13,R13),{1,2,3,4}))","v":243.05746420266561},"03:46:27",84.298998569384807,4.5618055555555559,82.759236123505246,"02:08:45",75.999229509775574,"",0,"",0,"",0,"",0,3,81.019154734221871]
[12,"Paul Jeggo",{"$f":"IFERROR(VLOOKUP(B14,INDIRECT(\"'\"&$I$1&\"'!\"&\"$C$2:$H$200\"),2,FALSE),\"\")","v":"Springfield"},{"$f":"IFERROR(VLOOKUP(B14,INDIRECT(\"'\"&$I$1&\"'!\"&\"$C$2:$H$200\"),3,FALSE),\"\")","v":"M"},{"$f":"IFERROR(VLOOKUP(B14,INDIRECT(\"'\"&$I$1&\"'!\"&\"$C$2:$H$200\"),4,FALSE),\"\")","v":"MV50"},{"$f":"SUM(LARGE((H14,J14,L14,N14,P14,R14),{1,2,3,4}))","v":230.14777132534019},"02:43:43",116.35159070781387,3.3541666666666665,113.79618061752632,"",0,"",0,"",0,"",0,"",0,2,115.07388566267009]
[13,"Tom Turner",{"$f":"IFERROR(VLOOKUP(B15,INDIRECT(\"'\"&$K$1&\"'!\"&\"$C$2:$H$200\"),2,FALSE),\"\")","v":"Mynydd Du"},{"$f":"IFERROR(VLOOKUP(B15,INDIRECT(\"'\"&$K$1&\"'!\"&\"$C$2:$H$200\"),3,FALSE),\"\")","v":"M"},{"$f":"IFERROR(VLOOKUP(B15,INDIRECT(\"'\"&$K$1&\"'!\"&\"$C$2:$H$200\"),4,FALSE),\"\")","v":"M"},{"$f":"SUM(LARGE((H15,J15,L15,N15,P15,R15),{1,2,3,4}))","v":227.95666241158634},"",0,3.3208333333333333,114.65286453685523,"01:30:01",113.3037978747311,"",0,"",0,"",0,"",0,2,113.97833120579317]
[14,"Dave Powell",{"$f":"IFERROR(VLOOKUP(B16,INDIRECT(\"'\"&$I$1&\"'!\"&\"$C$2:$H$200\"),2,FALSE),\"\")","v":"Aberystwyth AC"},{"$f":"IFERROR(VLOOKUP(B16,INDIRECT(\"'\"&$I$1&\"'!\"&\"$C$2:$H$200\"),3,FALSE),\"\")","v":"M"},{"$f":"IFERROR(VLOOKUP(B16,INDIRECT(\"'\"&$I$1&\"'!\"&\"$C$2:$H$200\"),4,FALSE),\"\")","v":"MV50"},{"$f":"SUM(LARGE((H16,J16,L16,N16,P16,R16),{1,2,3,4}))","v":224.10478918375514},"02:44:01",116.19831051161522,3.5833333333333335,107.90647867213991,"",0,"",0,"",0,"",0,"",0,2,112.05239459187757]
[15,"Hayley Evans",{"$f":"IFERROR(VLOOKUP(B17,INDIRECT(\"'\"&$G$1&\"'!\"&\"$C$2:$H$200\"),2,FALSE),\"\")","v":"Buckley Runners"},{"$f":"IFERROR(VLOOKUP(B17,INDIRECT(\"'\"&$G$1&\"'!\"&\"$C$2:$H$200\"),3,FALSE),\"\")","v":"F"},{"$f":"IFERROR(VLOOKUP(B17,INDIRECT(\"'\"&$G$1&\"'!\"&\"$C$2:$H$200\"),4,FALSE),\"\")","v":"Open"},{"$f":"SUM(LARGE((H17,J17,L17,N17,P17,R17),{1,2,3,4}))","v":223.71213418035359},"02:46:34",114.89542884392669,3.5479166666666671,108.81670533642689,"",0,"",0,"",0,"",0,"",0,2,111.85606709017679]
[16,"Andy Pritchard",{"$f":"IFERROR(VLOOKUP(B18,INDIRECT(\"'\"&$I$1&\"'!\"&\"$C$2:$H$200\"),2,FALSE),\"\")","v":"Buckley Runners"},{"$f":"IFERROR(VLOOKUP(B18,INDIRECT(\"'\"&$I$1&\"'!\"&\"$C$2:$H$200\"),3,FALSE),\"\")","v":"M"},{"$f":"IFERROR(VLOOKUP(B18,INDIRECT(\"'\"&$I$1&\"'!\"&\"$C$2:$H$200\"),4,FALSE),\"\")","v":"MV40"},{"$f":"SUM(LARGE((H18,J18,L18,N18,P18,R18),{1,2,3,4}))","v":220.60698143069712},"02:53:52",111.16561073642619,3.5236111111111108,109.44137069427093,"",0,"",0,"",0,"",0,"",0,2,110.30349071534856]
[17,"Steve 'Amazing' Hepton…",{"$f":"IFERROR(VLOOKUP(B19,INDIRECT(\"'\"&$G$1&\"'!\"&\"$C$2:$H$200\"),2,FALSE),\"\")","v":"Mynydd Du"},{"$f":"IFERROR(VLOOKUP(B19,INDIRECT(\"'\"&$G$1&\"'!\"&\"$C$2:$H$200\"),3,FALSE),\"\")","v":"M"},{"$f":"IFERROR(VLOOKUP(B19,INDIRECT(\"'\"&$G$1&\"'!\"&\"$C$2:$H$200\"),4,FALSE),\"\")","v":"V40"},{"$f":"SUM(LARGE((H19,J19,L19,N19,P19,R19),{1,2,3,4}))","v":217.22332833550038},"02:55:44",110.21186729341235,"",0,"01:36:33",107.01146104208803,"",0,"",0,"",0,"",0,2,108.61166416775019]
[18,"Helen Marshall",{"$f":"IFERROR(VLOOKUP(B20,INDIRECT(\"'\"&$K$1&\"'!\"&\"$C$2:$H$200\"),2,FALSE),\"\")","v":"Aberystwyth"},{"$f":"IFERROR(VLOOKUP(B20,INDIRECT(\"'\"&$K$1&\"'!\"&\"$C$2:$H$200\"),3,FALSE),\"\")","v":"F"},{"$f":"IFERROR(VLOOKUP(B20,INDIRECT(\"'\"&$K$1&\"'!\"&\"$C$2:$H$200\"),4,FALSE),\"\")","v":"F"},{"$f":"SUM(LARGE((H20,J20,L20,N20,P20,R20),{1,2,3,4}))","v":215.32326586255317},"",0,3.556944444444444,108.584686774942,"01:36:50",106.73857908761117,"",0,"",0,"",0,"",0,2,107.66163293127659]
{"$rows_left_out":239}
{"sheet":"Llanbedr 2 Bleanafon","index":2,"n_rows":122,"n_cols":12,"rows_kept":122,"cut":false,"hidden":false,"merged":[]}
["Position","Number","Name","Club","Gender","Category","Time","Points"]
[1,552,"Charlie Lowther","Mynydd Du","M","V40","02:14:22",{"$f":"(2-(G2/L$10))*100","v":131.34750323591524}]
[{"$f":"A2+1","v":2},530,"Hugh Aggleton","MDC","M","Open","02:15:29",{"$f":"(2-(G3/L$10))*100","v":130.77696028339804},null,"Number of runners","Position","Time (min.sec)"]
[{"$f":"A3+1","v":3},575,"Peter Ryder","Aberdare Valley","M","Open","02:15:35",130.72586688466515,null,{"$f":"COUNT(B2:B201)","v":121},{"$f":"K6+2","v":63},{"$f":"VLOOKUP(K4,A$2:G$201,7,FALSE)","v":"03:18:15"}]
[4,496,"Matt O'Keefe","MDC","M","Open","02:27:24",124.68833026772941,null,{"$f":"ISEVEN(J4)","v":false},{"$f":"K6+1","v":62},{"$f":"VLOOKUP(K5,A$2:G$201,7,FALSE)","v":"03:16:43"}]
[5,531,"Richard Roberts","Eryri Harriers","M","Open","02:28:51",123.94747598610259,null,null,{"$f":"IF(J5 = TRUE,(J4/2),((J4+1)/2))","v":61},"03:14:43"]
[6,577,"Jez Brown","Buckley Runners","M","V40","02:29:07",123.8112269228149,null,null,{"$f":"K6-1","v":60},"03:14:40"]
[7,502,"Martin Humphreys","Stroud AC","M","V40","02:29:09",123.79419578990394,null,null,{"$f":"K6-2","v":59},"03:14:15"]
[8,514,"Dan Sandford","Forest of Dean AC","M","V40","02:31:11",122.75529668233531,null,null,{"$f":"IF(J5 = TRUE, K6-3, \" \")","v":" "}]
[9,556,"Andrew Salt","Croft Ambrey","M","Open","02:31:21",122.67014101778048,null,null,null,{"$f":"IF(J5=TRUE,AVERAGE(L4:L9),AVERAGE(L4:L8))","v":"03:15:43.200"}]
[10,494,"Stuart Bellamy","Mercia Fell Runners","M","V40","02:31:28",122.61053205259213]
[11,519,"Iestyn Awesome Rhodes","Mynydd Du","M","V40","02:31:44",122.47428298930446]
[12,534,"Evan Davies","Mynydd Du","M","U23","02:35:19",120.64343620137609]
[13,592,"Andrew Stephens","Monross Trailblazers","M","V40","02:35:32",120.53273383745487]
[14,548,"Oliver Blomfield","Eden Runners","M","V40","02:39:27",118.53157572041692]
[15,571,"Stephen Jones","Eryri Harriers","M","V60","02:39:31",118.49751345459501]
[16,524,"Helen Brown","Mynydd Du","F","V40","02:41:09",117.66298794195791]
[17,529,"Leon Davies","NWRRC","M","V40","02:41:29",117.49267661284826]
[18,481,"Andy Davies","Mercia","M","V50","02:41:52",117.29681858437222]
[19,522,"Craig Jones","Eryri Harriers","M","V40","02:42:22",117.04135159070781]
{"$rows_left_out":103}
{"sheet":"Longtown Loop","index":3,"n_rows":136,"n_cols":12,"rows_kept":136,"cut":false,"hidden":false,"merged":[]}
["Position","Number","Name","Club","Gender","Category","Time","Points"]
[1,null,"Mark Hopkinson","Mynydd Du ",{"$f":"IF('[2]Longtown Llanthony Loop race pr'!$E2=\"Male\",\"M\",\"F\")","v":"M"},"SM",2.8104166666666668,{"$f":"(2-(G2/L$10))*100","v":127.77083705157951}]
[2,null,"Peter Ryder","Aberdare Valley",{"$f":"IF('[2]Longtown Llanthony Loop race pr'!$E3=\"Male\",\"M\",\"F\")","v":"M"},"SM",2.8402777777777781,{"$f":"(2-(G3/L$10))*100","v":127.00339104051399},null,"Number of runners","Position","Time (min.sec)"]
[3,null,"Alec Hough","Mercia fell runners",{"$f":"IF('[2]Longtown Llanthony Loop race pr'!$E4=\"Male\",\"M\",\"F\")","v":"M"},"SM",2.9361111111111113,124.54042477244332,null,87,{"$f":"K6+2","v":46},{"$f":"VLOOKUP(K4,A2:G201,7,FALSE)","v":3.9465277777777779}]
[4,null,"Matt O'Keefe","MDC",{"$f":"IF('[2]Longtown Llanthony Loop race pr'!$E5=\"Male\",\"M\",\"F\")","v":"M"},"SM",3.0201388888888889,122.38086739246832,null,"Was it an even field?",{"$f":"K6+1","v":45},3.9375]
[5,null,"James Blore","MDC",{"$f":"IF('[2]Longtown Llanthony Loop race pr'!$E6=\"Male\",\"M\",\"F\")","v":"M"},"SM",3.0409722222222224,121.84543994288775,null,{"$f":"ISEVEN(J4)","v":false},{"$f":"IF(J6 = TRUE,(J4/2),((J4+1)/2))","v":44},3.9076388888888887]
[6,null,"Jim Masters","Wye Valley Runners",{"$f":"IF('[2]Longtown Llanthony Loop race pr'!$E7=\"Male\",\"M\",\"F\")","v":"M"},"MV40",3.1770833333333335,118.34731393896125,null,null,{"$f":"K6-1","v":43},3.8416666666666668]
[7,null,"Dan Sandford","FODAC",{"$f":"IF('[2]Longtown Llanthony Loop race pr'!$E8=\"Male\",\"M\",\"F\")","v":"M"},"MV40",3.1854166666666668,118.13314295912902,null,null,{"$f":"K6-2","v":42},3.8215277777777779]
[8,null,"Chris Chambers","Mynydd Du",{"$f":"IF('[2]Longtown Llanthony Loop race pr'!$E9=\"Male\",\"M\",\"F\")","v":"M"},"MV40",3.3145833333333332,114.81349277172943,null,null,{"$f":"IF(J6 = TRUE, K6-3, Na)","v":{"$error":"#NAME?"}},{"$error":"#NAME?"}]
[9,null,"Tom Turner","Mynydd Du",{"$f":"IF('[2]Longtown Llanthony Loop race pr'!$E10=\"Male\",\"M\",\"F\")","v":"M"},"SM",3.3208333333333333,114.65286453685523,null,null,null,{"$f":"IF(J6=TRUE,AVERAGE(L4:L9),AVERAGE(L4:L8))","v":3.8909722222222221}]
[10,null,"james brown",null,{"$f":"IF('[2]Longtown Llanthony Loop race pr'!$E11=\"Male\",\"M\",\"F\")","v":"M"},"SM",3.3430555555555554,114.08174192396929]
[11,null,"Paul Jeggo","Springfield",{"$f":"IF('[2]Longtown Llanthony Loop race pr'!$E12=\"Male\",\"M\",\"F\")","v":"M"},"MV50",3.3541666666666665,113.79618061752632]
[12,null,"Gethin Powell","Pontypridd Roadents Ac",{"$f":"IF('[2]Longtown Llanthony Loop race pr'!$E13=\"Male\",\"M\",\"F\")","v":"M"},"SM",3.3625000000000003,113.58200963769409]
[13,null,"Helen Brown","Mynydd Du",{"$f":"IF('[2]Longtown Llanthony Loop race pr'!$E14=\"Male\",\"M\",\"F\")","v":"F"},"FV40",3.4486111111111111,111.36890951276102]
[14,null,"John Aggleton","MDC",{"$f":"IF('[2]Longtown Llanthony Loop race pr'!$E15=\"Male\",\"M\",\"F\")","v":"M"},"MV60",3.4527777777777775,111.26182402284491]
[15,null,"Steven 'Amazing' Hepton…","Mynydd Du",{"$f":"IF('[2]Longtown Llanthony Loop race pr'!$E16=\"Male\",\"M\",\"F\")","v":"M"},"MV40",3.4652777777777781,110.94056755309656]
[16,null,"Vincent Kamp",null,{"$f":"IF('[2]Longtown Llanthony Loop race pr'!$E17=\"Male\",\"M\",\"F\")","v":"M"},"MV40",3.4750000000000001,110.69070140995896]
[17,null,"Jonny Woolridge",null,{"$f":"IF('[2]Longtown Llanthony Loop race pr'!$E18=\"Male\",\"M\",\"F\")","v":"M"},"SM",3.4993055555555554,110.06603605211494]
[18,null,"David Mullin","Mercia Fell Runners",{"$f":"IF('[2]Longtown Llanthony Loop race pr'!$E19=\"Male\",\"M\",\"F\")","v":"M"},"MV40",3.5013888888888887,110.01249330715687]
[19,null,"Peter Nugent","Wye Valley Runners",{"$f":"IF('[2]Longtown Llanthony Loop race pr'!$E20=\"Male\",\"M\",\"F\")","v":"M"},"SM",3.505555555555556,109.90540781724074]
{"$rows_left_out":117}
{"sheet":"Cwmdu","index":4,"n_rows":72,"n_cols":12,"rows_kept":72,"cut":false,"hidden":false,"merged":[]}
["Position","Number","Name","Club","Gender","Category","Time","Points"]
[1,null,"Sam Tosh","Rossendale H","M","SM","01:17:32",{"$f":"(2-(G2/L$10))*100","v":125.32665575138849}]
[2,null,"Pete Ryder","Aberdare","M","SM",5.6296296296296296E-2,{"$f":"(2-(G3/L$10))*100","v":121.92365726026517},null,"Number of runners","Position","Time (hr.min.sec)"]
[3,null,"Jack Agnew","Mercia","M","U23",6.0150462962962954E-2,116.57838132845357,null,71,{"$f":"K6+2","v":38},{"$f":"VLOOKUP(K4,A$2:G$201,7,FALSE)","v":"01:45:02"}]
[4,null,"Andy Stephens","Monross","M","M40",6.1238425925925932E-2,115.06950463899321,null,"Was it an even field?",{"$f":"K6+1","v":37},{"$f":"VLOOKUP(K5,A$2:G$201,7,FALSE)","v":"01:44:44"}]
[5,null,"Tom Turner","Mynydd Du","M","M",6.2511574074074081E-2,113.3037978747311,null,{"$f":"ISEVEN(J4)","v":false},{"$f":"IF(J6 = TRUE,(J4/2),((J4+1)/2))","v":36},"01:43:44"]
[6,null,"Wyndham Turner",null,"M","M",6.3113425925925934E-2,112.46910013162541,null,null,{"$f":"K6-1","v":35},"01:43:26"]
[7,null,"Mel Price","Mercia","F","F40",6.3252314814814817E-2,112.2764775755241,null,null,{"$f":"K6-2","v":34},{"$f":"VLOOKUP(K8,A$2:G$201,7,FALSE)","v":"01:42:13"}]
[8,null,"Dan Sandford","FOD","M","M40",6.3935185185185178E-2,111.32941667469262,null,null,null,{"$f":"VLOOKUP(K9,A7:G206,7,FALSE)","v":{"$error":"#N/A"}}]
[9,null,"Nigeal Rogerson",null,"M","M40",6.458333333333334E-2,110.43051141288642,null,null,null,{"$f":"IF(J6=TRUE,AVERAGE(L4:L9),AVERAGE(L4:L8))","v":"01:43:49.800"}]
[10,null,"Matt O'Keefe","MDC","M","M",6.4652777777777767E-2,110.3342001348358]
[11,null,"Helen Brown","Mynydd Du","F","F40",6.474537037037037E-2,110.2057850974349]
[12,null,"Ian Luke","Poole R","M","M",6.4791666666666664E-2,110.14157757873448]
[13,null,"Dan Lewis","Wye V","M","M40",6.5601851851851856E-2,109.01794600147676]
[14,null,"Michael Reynolds","Mercia","M","M50",6.5763888888888886E-2,108.79321968602524]
[15,null,"John Aggleton","MDC","M","M60",6.6724537037037027E-2,107.46091367299111]
[16,null,"Steve 'Amazing' Hepton…","Mynydd Du","M","M40",6.7048611111111114E-2,107.01146104208803]
[17,null,"Helen Marshall","Aberystwyth","F","F",6.7245370370370358E-2,106.73857908761117]
[18,null,"Niki Radnege",null,"M","M40",6.7291666666666666E-2,106.67437156891073]
[19,null,"Mark Agnew","Mercia","M","M50",6.7731481481481476E-2,106.06440014125656]
{"$rows_left_out":53}
{"sheet":"Middletown Show","index":5,"n_rows":97,"n_cols":12,"rows_kept":97,"cut":false,"hidden":false,"merged":[]}
["Position","Number","Name","Club","Gender","Category","Time","Points"]
[1]
[{"$f":"A2+1","v":2},null,null,null,null,null,null,null,null,"Number of runners","Position","Time (min.sec)"]
[{"$f":"A3+1","v":3},null,null,null,null,null,null,null,null,{"$f":"COUNT(A2:A201)","v":96},{"$f":"K6+2","v":50},{"$f":"VLOOKUP(K4,A2:G201,7,FALSE)","v":"00:00:00"}]
[4,null,null,null,null,null,null,null,null,{"$f":"ISEVEN(J4)","v":true},{"$f":"K6+1","v":49},{"$f":"VLOOKUP(K5,A3:G202,7,FALSE)","v":"00:00:00"}]
[5,null,null,null,null,null,null,null,null,null,{"$f":"IF(J5 = TRUE,(J4/2),((J4+1)/2))","v":48},"00:00:00"]
[6,null,null,null,null,null,null,null,null,null,{"$f":"K6-1","v":47},"00:00:00"]
[7,null,null,null,null,null,null,null,null,null,{"$f":"K6-2","v":46},"00:00:00"]
[8,null,null,null,null,null,null,null,null,null,{"$f":"IF(J5 = TRUE, K6-3, Na)","v":45},"00:00:00"]
[9,null,null,null,null,null,null,null,null,null,null,{"$f":"IF(J5=TRUE,AVERAGE(L4:L9),AVERAGE(L4:L8))","v":"00:00:00"}]
[10]
[11]
[12]
[13]
[14]
[15]
[16]
[17]
[18]
[19]
{"$rows_left_out":78}
{"sheet":"Guto Nyth Bran","index":6,"n_rows":39,"n_cols":12,"rows_kept":39,"cut":false,"hidden":false,"merged":[]}
["Position","Number","Name","Club","Gender","Category","Time","Points"]
[1]
[{"$f":"A2+1","v":2},null,null,null,null,null,null,null,null,"Number of runners","Position","Time (min.sec)"]
[{"$f":"A3+1","v":3},null,null,null,null,null,null,null,null,{"$f":"COUNT(A2:A201)","v":38},{"$f":"K6+2","v":21},{"$f":"VLOOKUP(K4,A2:G201,7,FALSE)","v":"00:00:00"}]
[4,null,null,null,null,null,null,null,null,{"$f":"ISEVEN(J4)","v":true},{"$f":"K6+1","v":20},"00:00:00"]
[5,null,null,null,null,null,null,null,null,null,{"$f":"IF(J5 = TRUE,(J4/2),((J4+1)/2))","v":19},"00:00:00"]
[6,null,null,null,null,null,null,null,null,null,{"$f":"K6-1","v":18},"00:00:00"]
[7,null,null,null,null,null,null,null,null,null,{"$f":"K6-2","v":17},"00:00:00"]
[8,null,null,null,null,null,null,null,null,null,{"$f":"IF(J5 = TRUE, K6-3, Na)","v":16},"00:00:00"]
[9,null,null,null,null,null,null,null,null,null,null,{"$f":"IF(J5=TRUE,AVERAGE(L4:L9),AVERAGE(L4:L8))","v":"00:00:00"}]
[10]
[11]
[12]
[13]
[14]
[15]
[16]
[17]
[18]
[19]
{"$rows_left_out":20}
{"sheet":"Brecon Beacons","index":7,"n_rows":40,"n_cols":12,"rows_kept":40,"cut":false,"hidden":false,"merged":[]}
["Position","Number","Name","Club","Sex","Category","Time","Points"]
[1]
[2,null,null,null,null,null,null,null,null,"Number of runners","Position","Time (min.sec)"]
[3,null,null,null,null,null,null,null,null,{"$f":"COUNT(A2:A201)","v":39},{"$f":"K6+2","v":22},{"$f":"VLOOKUP(K4,A2:G201,7,FALSE)","v":0}]
[4,null,null,null,null,null,null,null,null,{"$f":"ISEVEN(J4)","v":false},{"$f":"K6+1","v":21},{"$f":"VLOOKUP(K5,A2:G202,7,FALSE)","v":0}]
[5,null,null,null,null,null,null,null,null,null,{"$f":"IF(J5 = TRUE,(J4/2),((J4+1)/2))","v":20},{"$f":"VLOOKUP(K6,A3:G203,7,FALSE)","v":0}]
[6,null,null,null,null,null,null,null,null,null,{"$f":"K6-1","v":19},{"$f":"VLOOKUP(K7,A4:G204,7,FALSE)","v":0}]
[7,null,null,null,null,null,null,null,null,null,{"$f":"K6-2","v":18},{"$f":"VLOOKUP(K8,A5:G205,7,FALSE)","v":0}]
[8,null,null,null,null,null,null,null,null,null,{"$f":"IF(J5 = TRUE, K6-3, Na)","v":{"$error":"#NAME?"}},{"$f":"VLOOKUP(K9,A6:G206,7,FALSE)","v":{"$error":"#NAME?"}}]
[9,null,null,null,null,null,null,null,null,null,null,{"$f":"IF(J5=TRUE,AVERAGE(L4:L9),AVERAGE(L4:L8))","v":0}]
[10]
[11]
[12]
[13]
[14]
[15]
[16]
[17]
[18]
[19]
{"$rows_left_out":21}
{"sheet":"Fan Fawr","index":8,"n_rows":0,"n_cols":0,"rows_kept":0,"cut":false,"hidden":false,"merged":[]}

{"sheet":"WFRA Membership March 2017","index":9,"n_rows":413,"n_cols":11,"rows_kept":413,"cut":false,"hidden":false,"merged":[]}
[]
[null,null,"1st","2nd","middle name removed","Spaces Trimed","Spaces Trimed",null,null,"Hopefully this is the name used at races…"]
[null,null,"Ross","Roberts",{"$f":"IF(ISERROR(FIND(\" \",C3)),C3,MID(C3,1,FIND(\" \",C3)))","v":"Ross"},{"$f":"TRIM(E3)","v":"Ross"},{"$f":"TRIM(D3)","v":"Roberts"},null,null,{"$f":"_xlfn.CONCAT(F3,\" \",G3)","v":"Ross Roberts"},{"$f":"J3","v":"Ross Roberts"}]
[null,null,"Tony","Wood",{"$f":"IF(ISERROR(FIND(\" \",C4)),C4,MID(C4,1,FIND(\" \",C4)))","v":"Tony"},{"$f":"TRIM(E4)","v":"Tony"},{"$f":"TRIM(D4)","v":"Wood"},null,null,{"$f":"_xlfn.CONCAT(F4,\" \",G4)","v":"Tony Wood"},{"$f":"J4","v":"Tony Wood"}]
[null,null,"Sue","Buck","Sue","Sue","Buck",null,null,"Sue Buck","Sue Buck"]
[null,null,"Emma","Collins","Emma","Emma","Collins",null,null,"Emma Collins","Emma Collins"]
[null,null,"Adrian","Moir","Adrian","Adrian","Moir",null,null,{"$f":"_xlfn.CONCAT(F7,\" \",G7)","v":"Adrian Moir"},"Adrian Moir"]
[null,null,"Martin","Cable","Martin","Martin","Cable",null,null,"Martin Cable","Martin Cable"]
[null,null,"Dave","Farrow","Dave","Dave","Farrow",null,null,"Dave Farrow","Dave Farrow"]
[null,null,"John","Rowley","John","John","Rowley",null,null,"John Rowley","John Rowley"]
[null,null,"Miranda","Grant","Miranda","Miranda","Grant",null,null,"Miranda Grant","Miranda Grant"]
[null,null,"Aled","Edwards","Aled","Aled","Edwards",null,null,"Aled Edwards","Aled Edwards"]
[null,null,"Richard","Self","Richard","Richard","Self",null,null,"Richard Self","Richard Self"]
[null,null,"Craig","Edwards","Craig","Craig","Edwards",null,null,"Craig Edwards","Craig Edwards"]
[null,null,"Richard","Applewhite","Richard","Richard","Applewhite",null,null,"Richard Applewhite","Richard Applewhite"]
[null,null,"Simon","Adney","Simon","Simon","Adney",null,null,"Simon Adney","Simon Adney"]
[null,null,"John","Aggleton","John","John","Aggleton",null,null,"John Aggleton","John Aggleton"]
[null,null,"Hugh","Aggleton","Hugh","Hugh","Aggleton",null,null,"Hugh Aggleton","Hugh Aggleton"]
[null,null,"Paul","Aird","Paul","Paul","Aird",null,null,"Paul Aird","Paul Aird"]
[null,null,"Dave","Andrews","Dave","Dave","Andrews",null,null,"Dave Andrews","Dave Andrews"]
{"$rows_left_out":393}